program: Orca
programVersion: 4.2.1
elementType: Cl Cl O O N N N C C C C C C C C C C C C C C H H H H H H H H H H H H H H H
charge: 0
multiplicity: 1
keywords: wb97x-d3
keywords: def2-TZVPP
keywords: def2/J RIJCOSX GRIDX6 NOFINALGRIDX
keywords: grid4 nofinalgrid
keywords: scfconv7
keywords: smallprint printgap noloewdin
keywords: NOSOSCF
formula: C14H15Cl2N3O2
InChI: InChI=1/C14H15Cl2N3O2/c1-2-11-6-20-14(21-11,7-19-9-17-8-18-19)12-4-3-10(15)5-13(12)16/h3-5,8-9,11H,2,6-7H2,1H3
36 atoms
Cl 0.881113 0.154839 -2.318175
Cl 4.017672 -3.762473 -0.538835
O  -1.310229 0.296568 -0.358576
O  -0.885289 0.001311 1.827936
N  -0.727035 2.715107 0.858114
N  -1.127276 3.088079 2.07797
N  -2.422928 4.028214 0.5056
C  -0.298618 0.313503 0.596875
C  -2.424663 -0.407311 0.165018
C  -2.27832 -0.148641 1.656719
C  0.298452 1.730139 0.663585
C  0.791919 -0.704674 0.281735
C  -3.701959 0.114359 -0.456169
C  -3.768318 -0.099137 -1.961448
C  1.358576 -0.840751 -0.984925
C  1.27493 -1.536102 1.287663
C  2.347366 -1.778427 -1.243098
C  2.264662 -2.474965 1.055708
C  -1.517694 3.278617 -0.067672
C  2.792447 -2.593389 -0.217836
C  -2.140461 3.877184 1.818034
H  -2.316996 -1.480943 -0.049774
H  -2.806126 0.761007 1.965124
H  -2.629145 -0.980365 2.269609
H  0.838397 1.960201 -0.25419
H  1.000032 1.790894 1.493809
H  -3.808364 1.176458 -0.217685
H  -4.540364 -0.396976 0.025936
H  -3.702419 -1.157729 -2.217388
H  -4.706793 0.279536 -2.36486
H  -2.95558 0.41516 -2.472719
H  0.860615 -1.45052 2.281705
H  2.762204 -1.869128 -2.23678
H  2.617247 -3.108557 1.857065
H  -1.392128 3.11574 -1.126528
H  -2.69303 4.369546 2.602917
totalener: -1777.70286970 hartree
nucrepener: 2034.61713185 hartree
electener: -3812.32000155 hartree
oneelecener: -6482.54161306 hartree
twoeener: 2670.22161151 hartree
kineticenergy: 1772.81441488 hartree
xcener: -124.638885711004 hartree
chargesum: -0.0000000
charge: -0.064583 -0.064712 -0.361381 -0.353598 0.130045 -0.311305 -0.332423 0.561570 0.151641 -0.006362 -0.135674 -0.091866 -0.141338 -0.238161 -0.019502 -0.127417 -0.154609 -0.154282 0.018781 0.104713 0.053293 0.073735 0.075249 0.089509 0.135062 0.120776 0.070949 0.074287 0.071308 0.088203 0.085348 0.139643 0.115009 0.125235 0.141558 0.131297
qa: -0.0646 -0.0647 -0.3614 -0.3536 0.1300 -0.3113 -0.3324 0.5616 0.1516 -0.0064 -0.1357 -0.0919 -0.1413 -0.2382 -0.0195 -0.1274 -0.1546 -0.1543 0.0188 0.1047 0.0533 0.0737 0.0752 0.0895 0.1351 0.1208 0.0709 0.0743 0.0713 0.0882 0.0853 0.1396 0.1150 0.1252 0.1416 0.1313
va: 1.2554 1.2408 2.0044 2.0174 3.3281 2.8551 3.0295 3.8542 3.8449 4.0289 3.8211 3.6317 3.9401 3.9373 4.0166 3.9649 4.0848 4.0418 4.0836 3.9296 4.0346 1.0039 0.9987 1.0010 1.0164 1.0272 1.0184 1.0106 1.0051 1.0067 1.0111 1.0300 1.0271 1.0143 1.0094 1.0018
dispcorr: -0.020970206 hartree
energy: -1777.723839908735
dipole: -28.47496 28.36268 -0.11229 8.01667 -9.00825 -0.99159 5.22553 -5.23878 -0.01325
magnitude: 0.99801 au
magnitude: 2.53674 debye
