program: Orca
programVersion: 4.2.1
elementType: Cl Cl O O N N N C C C C C C C C C C C C C C H H H H H H H H H H H H H H H
charge: 0
multiplicity: 1
keywords: wb97x-d3
keywords: def2-TZVPP
keywords: def2/J RIJCOSX GRIDX6 NOFINALGRIDX
keywords: grid4 nofinalgrid
keywords: scfconv7
keywords: smallprint printgap noloewdin
keywords: NOSOSCF
formula: C14H15Cl2N3O2
InChI: InChI=1/C14H15Cl2N3O2/c1-2-11-6-20-14(21-11,7-19-9-17-8-18-19)12-4-3-10(15)5-13(12)16/h3-5,8-9,11H,2,6-7H2,1H3
36 atoms
Cl 0.770093 -1.485512 2.500193
Cl 4.537052 -1.507777 -1.263528
O  -1.883551 0.026082 -0.813765
O  -1.789945 -1.237485 1.040987
N  -0.607182 2.183301 0.581369
N  -1.363786 2.995646 -0.162919
N  0.782313 3.639172 -0.240232
C  -1.144634 -0.21351 0.34777
C  -2.993179 -0.85887 -0.867168
C  -2.55868 -1.953981 0.098849
C  -1.16614 1.038215 1.243927
C  0.28398 -0.587089 -0.040315
C  -4.286467 -0.161865 -0.469832
C  -4.554451 1.105806 -1.267683
C  1.1948 -1.14121 0.857856
C  0.743711 -0.314503 -1.325495
C  2.49991 -1.430763 0.487041
C  2.042232 -0.588467 -1.716964
C  0.673427 2.580655 0.518916
C  2.914676 -1.152322 -0.803075
C  -0.491571 3.851936 -0.632836
H  -3.07294 -1.22755 -1.894591
H  -3.387083 -2.434429 0.620139
H  -1.961676 -2.726154 -0.401077
H  -0.612602 0.851908 2.163754
H  -2.196646 1.270435 1.509467
H  -4.267785 0.066844 0.600402
H  -5.104349 -0.87484 -0.612844
H  -3.779384 1.852209 -1.098928
H  -4.596468 0.899918 -2.338794
H  -5.510157 1.544312 -0.98218
H  0.067273 0.132342 -2.039305
H  3.182412 -1.867425 1.20211
H  2.370713 -0.359837 -2.720761
H  1.474556 2.075537 1.037249
H  -0.784552 4.665347 -1.27783
totalener: -1777.69988490 hartree
nucrepener: 2054.23897169 hartree
electener: -3831.93885659 hartree
oneelecener: -6521.91618116 hartree
twoeener: 2689.97732457 hartree
kineticenergy: 1772.81080220 hartree
xcener: -124.637984804503 hartree
chargesum: -0.0000000
charge: -0.056185 -0.063447 -0.366581 -0.326479 0.140476 -0.313238 -0.327011 0.562372 0.139206 0.008276 -0.167876 -0.186507 -0.173147 -0.239384 -0.002217 -0.092738 -0.146851 -0.142351 0.021555 0.107250 0.070405 0.084346 0.089747 0.081604 0.141066 0.116490 0.069749 0.066914 0.103806 0.067495 0.081747 0.137503 0.113612 0.125878 0.145692 0.128823
qa: -0.0562 -0.0634 -0.3666 -0.3265 0.1405 -0.3132 -0.3270 0.5624 0.1392 0.0083 -0.1679 -0.1865 -0.1731 -0.2394 -0.0022 -0.0927 -0.1469 -0.1424 0.0216 0.1072 0.0704 0.0843 0.0897 0.0816 0.1411 0.1165 0.0697 0.0669 0.1038 0.0675 0.0817 0.1375 0.1136 0.1259 0.1457 0.1288
va: 1.2670 1.2414 1.9918 2.0330 3.2780 2.8711 3.0652 3.8764 3.9194 4.0030 3.8810 3.6524 3.9289 3.9286 3.9835 3.8775 4.0833 4.0513 4.0932 3.9297 4.0338 0.9942 0.9932 1.0012 1.0172 1.0218 1.0095 1.0123 1.0245 1.0041 1.0066 1.0308 1.0285 1.0128 0.9980 1.0010
dispcorr: -0.021447706 hartree
energy: -1777.721332602727
dipole: -33.69545 32.73265 -0.96280 7.53824 -8.65990 -1.12166 -7.53208 7.48406 -0.04802
magnitude: 1.47899 au
magnitude: 3.75929 debye
