program: Orca
programVersion: 4.2.1
elementType: Cl Cl O O N N N C C C C C C C C C C C C C C H H H H H H H H H H H H H H H
charge: 0
multiplicity: 1
keywords: wb97x-d3
keywords: def2-TZVPP
keywords: def2/J RIJCOSX GRIDX6 NOFINALGRIDX
keywords: grid4 nofinalgrid
keywords: scfconv7
keywords: smallprint printgap noloewdin
keywords: NOSOSCF
formula: C14H15Cl2N3O2
InChI: InChI=1/C14H15Cl2N3O2/c1-2-11-6-20-14(21-11,7-19-9-17-8-18-19)12-4-3-10(15)5-13(12)16/h3-5,8-9,11H,2,6-7H2,1H3
36 atoms
Cl 1.333924 0.430166 -2.192688
Cl 4.082485 -3.760303 -0.393505
O  -1.165815 0.41279 -0.621688
O  -1.109752 -0.147869 1.553908
N  -0.75337 2.649496 0.973397
N  -1.329662 2.885145 2.156397
N  -2.352681 4.055498 0.538976
C  -0.324154 0.284412 0.480566
C  -2.364389 -0.301357 -0.37041
C  -2.458451 -0.225062 1.146721
C  0.275494 1.661774 0.813628
C  0.789471 -0.727012 0.229211
C  -3.515928 0.33878 -1.115548
C  -4.824436 -0.403998 -0.880252
C  1.566793 -0.728518 -0.928157
C  1.080722 -1.688912 1.191769
C  2.577073 -1.657805 -1.125904
C  2.086221 -2.623704 1.01908
C  -1.383114 3.349398 0.018165
C  2.828439 -2.60334 -0.148147
C  -2.278344 3.734527 1.848977
H  -2.248186 -1.346661 -0.69283
H  -3.013781 0.662085 1.474139
H  -2.917224 -1.107677 1.594522
H  0.953913 1.98388 0.024567
H  0.84122 1.597558 1.741583
H  -3.286211 0.351461 -2.183142
H  -3.612271 1.381322 -0.799985
H  -4.753336 -1.450177 -1.181752
H  -5.124509 -0.381027 0.168557
H  -5.632935 0.046445 -1.453807
H  0.500795 -1.71106 2.102765
H  3.158768 -1.640207 -2.036284
H  2.286584 -3.36008 1.784285
H  -1.099237 3.312394 -1.021643
H  -2.935797 4.147269 2.597926
totalener: -1777.70273127 hartree
nucrepener: 2023.54332963 hartree
electener: -3801.24606089 hartree
oneelecener: -6460.36934645 hartree
twoeener: 2659.12328555 hartree
kineticenergy: 1772.81704860 hartree
xcener: -124.639903962952 hartree
chargesum: -0.0000000
charge: -0.062919 -0.064915 -0.358569 -0.357313 0.129674 -0.311285 -0.333078 0.550477 0.170637 -0.024465 -0.136285 -0.090870 -0.134464 -0.258629 -0.020257 -0.126845 -0.153171 -0.153342 0.014752 0.104379 0.052218 0.074530 0.081728 0.093129 0.135588 0.121200 0.075585 0.072927 0.080579 0.078924 0.095146 0.139429 0.114158 0.124330 0.145690 0.131329
qa: -0.0629 -0.0649 -0.3586 -0.3573 0.1297 -0.3113 -0.3331 0.5505 0.1706 -0.0245 -0.1363 -0.0909 -0.1345 -0.2586 -0.0203 -0.1268 -0.1532 -0.1533 0.0148 0.1044 0.0522 0.0745 0.0817 0.0931 0.1356 0.1212 0.0756 0.0729 0.0806 0.0789 0.0951 0.1394 0.1142 0.1243 0.1457 0.1313
va: 1.2574 1.2406 2.0142 2.0169 3.3278 2.8549 3.0249 3.8728 3.8438 4.0059 3.8184 3.6308 3.9387 3.9442 4.0191 3.9626 4.0815 4.0415 4.0782 3.9279 4.0360 1.0057 0.9923 0.9971 1.0169 1.0266 1.0114 1.0154 1.0034 1.0025 1.0063 1.0302 1.0275 1.0145 1.0095 1.0020
dispcorr: -0.020576155 hartree
energy: -1777.723307420917
dipole: -32.37381 32.19161 -0.18220 6.72237 -7.70107 -0.97870 5.39099 -5.55713 -0.16614
magnitude: 1.00929 au
magnitude: 2.56541 debye
