program: Gaussian 09
title: 000063334
version: EM64L-G09RevD.01
frameworkgroup: C1[X(C12H8ClN3O2)]
method: RPBEPBE
basis: SDD
operation: Freq
keyword: #p
keyword: freq=noraman
keyword: PBEPBE/SDD
title: #p freq=noraman PBEPBE/SDD
converged: YES YES NO NO
title: Mulliken charges:
elementType: Cl O O N N N C C C C C C C C C C C C H H H H H H H H
charge: -0.030386 -0.267857 -0.242099 -0.252282 -0.003203 -0.049126 0.146763 0.157799 0.086383 0.445454 -0.260305 -0.308296 -0.458493 -0.306300 0.218995 -0.228581 -0.085315 -0.754320 0.298647 0.278477 0.317029 0.291406 0.265508 0.243141 0.243011 0.253951
chargesum: 0.00000
title: Mulliken charges with hydrogens summed into heavy atoms:
elementType: Cl O O N N N C C C C C C C C C C C C
charge: -0.030386 -0.267857 -0.242099 -0.252282 -0.003203 -0.049126 0.146763 0.157799 0.086383 0.445454 0.038342 -0.029819 -0.141465 -0.014894 0.218995 0.036927 -0.085315 -0.014216
polarizability: 3.30902701e+02 3.34750431e+00 1.56311595e+02 -3.00179511e-02 -2.69721194e-03 6.76455022e+01
1716.lowfreq: -6.7381 -4.8689 -0.0012 0.0002 0.0016 6.1719 31.8331 42.4054 93.6259
frequency: 31.8318 42.3360 93.6249 95.6897 124.1702 131.8425 182.0732 189.6887 237.4094 257.7714 280.7454 286.1654 326.1610 378.7962 395.4973 421.2473 425.6282 502.1131 506.2838 543.6032 575.5594 602.8768 626.5106 640.0420 659.1251 677.7805 683.3914 744.5605 779.3427 810.3193 843.2497 845.6867 863.0674 870.7310 897.4120 920.1061 934.5850 964.6061 983.5085 1002.5020 1022.3020 1046.9443 1063.3100 1112.0468 1119.1572 1171.0243 1209.4822 1234.9650 1251.5434 1270.1269 1368.3923 1391.5416 1401.8966 1408.1861 1418.5385 1439.4369 1451.0598 1465.3781 1481.0973 1547.4037 1555.9240 1591.7382 1601.2783 1626.1538 2995.7448 3080.2969 3112.1437 3160.2966 3180.7364 3187.2604 3187.8745 3284.3634
redmass: 8.5676 5.0731 8.4466 6.1263 1.5686 2.0654 4.4735 7.3326 11.2191 5.8003 5.6816 4.5903 11.1315 8.6907 4.9430 6.3830 3.0594 3.8667 8.2879 8.4472 7.4628 7.0813 5.4636 6.3297 4.2080 6.6718 5.1037 6.7411 3.7031 11.8047 1.5427 8.3549 1.3019 6.5933 1.4701 1.4360 7.5091 2.3241 1.3417 2.2655 4.2872 1.5043 1.8547 2.2030 2.0339 3.4836 2.3618 2.4862 2.6453 2.8729 2.3892 1.8313 2.7183 1.9153 3.3206 4.7035 2.7442 1.0443 1.3492 7.9251 8.1894 8.4652 7.5746 11.0897 1.0368 1.0984 1.0994 1.0890 1.0972 1.0937 1.0948 1.0997
irintensity: 0.0033 5.2980 1.9828 0.9512 2.4000 2.9016 0.8058 3.7187 0.9752 1.1475 1.8997 0.5270 1.5734 0.0916 14.2100 3.3591 9.6440 0.9496 2.3101 7.6269 3.7189 0.1894 5.0689 24.0137 5.2656 0.0915 7.8881 12.6034 10.3770 3.5252 31.3584 57.1345 44.8291 39.6157 7.0553 26.2259 17.8212 1.5569 1.0404 1.9594 11.3138 6.8849 53.1375 6.2289 59.9048 3.0491 47.6604 75.3638 49.4085 17.1197 15.5645 25.1667 30.0998 88.2233 5.6387 35.5831 120.9276 17.9341 9.6979 89.7311 294.2259 3.2056 223.2920 264.8196 15.9987 11.8582 7.5709 0.5149 1.3723 2.4459 1.5745 7.9659
temp: 298.150 k
press: 1.00000 atm
elementType: 17 8 8 7 7 7 6 6 6 6 6 6 6 6 6 6 6 6 1 1 1 1 1 1 1 1
symmnumber: 1
zpe: 471420.1 jmol-1
zpe.correction: 0.179554 hartree
zpe.thermalcorrener: 0.194303 hartree
zpe.thermalcorrenthalpy: 0.195247 hartree
zpe.thermalcorrgfe: 0.136528 hartree
zpe.sumelectzpe: -1235.563057 hartree
zpe.sumelectthermal: -1235.548309 hartree
zpe.sumelectthermalent: -1235.547364 hartree
zpe.sumelectthermalfe: -1235.606084 hartree
dipole: 0.5862 2.5666 0.0080
dipole: 2.6327
quadrupole: -104.8287 -113.3132 -111.4888
quadrupole: 7.0008 0.0301 0.0244
quadrupole: 5.0482 -3.4363 -1.6118 7.0008 0.0301 0.0244
hfenergy: -1235.7426117 hartree
pointgroup: C01 [X(C12H8Cl1N3O2)]
dipole: 0.3031251 -0.7582727 0.6371894 debye
dipolederiv: -1.0381168 -0.0097654 -0.0468078 0.0320845 -0.0860106 0.0288412 -0.0817548 0.0264754 -0.0795736 -0.6956387 0.1380485 -0.1439093 0.0120715 -0.2938417 0.1421616 -0.0402779 0.1490775 -0.2459461 -0.650301 0.2242437 -0.2035907 0.1609464 -0.6567098 0.2782419 -0.1506927 0.2809557 -0.5729241 -1.3206723 -0.2214185 0.1103057 0.3187522 -0.4769278 0.4279771 -0.336169 0.3982395 -0.3263765 -1.2627771 -0.0949166 0.0227626 -0.0801407 -0.3214088 0.058529 0.0097676 0.0575048 -0.292021 -0.1065539 -0.1316901 0.1118514 -0.156279 -0.1245095 -0.0532959 0.1328719 -0.0517504 -0.1294047 -0.569005 0.1477593 -0.1524799 0.0098638 -0.1039663 0.0623948 -0.0382234 0.0704491 -0.0892933 1.1787909 -0.088045 0.1268256 0.1262747 0.8488676 -0.5145002 -0.0502034 -0.5249606 0.6522484 0.8840079 0.2686097 -0.1766532 0.1829978 0.1902497 -0.0829193 -0.1052057 -0.0776325 0.1363653 1.2892809 0.0439903 0.0262037 -0.0191486 0.2558947 -0.1083307 0.0788996 -0.1051905 0.2151432 1.1396031 -0.1188902 0.1592327 -0.7253758 0.2381745 -0.218092 0.6594431 -0.1855022 0.2089933 0.0647565 -0.1416541 0.1255619 0.116511 -0.0217577 -0.0442269 -0.0881677 -0.0589216 -0.0395164 -0.743386 0.0725842 -0.0886695 0.1054981 -0.1445188 -0.0414254 -0.1152629 -0.0433962 -0.1714602 -0.7683991 -0.1920601 0.1208971 -0.2334402 -0.0781831 -0.0233333 0.1543663 -0.0215213 -0.0646389 0.8270038 -0.0754857 0.1036992 0.0526715 0.0752459 -0.0296044 -0.0022186 -0.0364801 0.0654732 -0.3729599 0.1736174 -0.15778 0.0466949 -0.0891792 -0.0160643 -0.052871 -0.0089843 -0.1078934 1.6252268 0.0180421 0.078586 0.0746663 0.1593732 -0.1698381 0.0324733 -0.17265 0.0928844 -0.1100154 0.0426183 -0.0443098 0.0703102 0.0274808 0.0373773 -0.0676803 0.0361613 0.0351478 0.1055094 -0.0330056 0.0247495 -0.0247054 0.1174446 0.0223852 0.0176462 0.0218108 0.1291444 0.0838175 0.0486347 -0.0441977 0.0034585 0.0798409 0.0624786 -0.0069707 0.0650834 0.1012788 0.204691 -0.0250753 0.0206074 -0.0269816 0.1376925 0.0582097 0.0219986 0.0584303 0.1632011 0.0973049 0.0118449 -0.0138169 0.029431 0.0942427 0.0629787 -0.0283197 0.0620001 0.1158997 0.0392608 -0.0536678 0.0370188 -0.0493541 0.0801312 0.069018 0.0335907 0.068772 0.1124747 0.0515834 0.0218682 0.0024961 0.0140818 0.1212671 -0.0160471 -0.0634236 -0.0157023 -0.0950533 0.0496007 0.0106736 -0.0227939 0.0740957 -0.0780349 -0.0511971 -0.0025565 -0.0543273 0.1064954 -0.0026124 -0.0368603 0.0242108 -0.1149844 0.0491425 0.0582817 0.0889407 0.0620594 0.0793517 unknown
polarizability: 330.0027854|14.2140477|121.2892002|2.6106853|-43.4242413|103.5678119 unknown
InChI: InChI=1S/C12H8ClN3O2/c1-7-4-11(18-15-7)16-6-14-10-5-8(13)2-3-9(10)12(16)17/h2-6H,1H3
charge 0 multiplicity 1
26 atoms
Cl -5.99392 -0.05271 -0.181609
O  2.806767 1.64673 -1.09596
O  0.671932 -1.194438 1.135215
N  0.786568 0.629943 -0.366308
N  -1.203708 1.642626 -1.309616
N  4.273265 1.521701 -0.916909
C  -1.399568 -0.274721 0.259236
C  0.061023 -0.359982 0.411522
C  -1.987653 0.716883 -0.59103
C  2.198227 0.658851 -0.314743
C  0.100847 1.570965 -1.178582
C  -2.230785 -1.185566 0.963369
C  3.15613 -0.087479 0.349226
C  -3.399664 0.784219 -0.725934
C  4.41738 0.484612 -0.056208
C  -3.626394 -1.121109 0.831376
C  -4.186674 -0.130519 -0.016319
C  5.798792 0.064443 0.359972
H  0.742677 2.270558 -1.718337
H  -1.7594 -1.933959 1.607724
H  2.982345 -0.917266 1.024026
H  -3.83206 1.546105 -1.37857
H  -4.276341 -1.817165 1.368222
H  5.920344 0.149358 1.454496
H  5.987532 -0.987638 0.081793
H  6.556639 0.698256 -0.127853
