program: Orca
programVersion: 4.2.1
elementType: Cl Cl O O N N N C C C C C C C C C C C C C C H H H H H H H H H H H H H H H
charge: 0
multiplicity: 1
keywords: wb97x-d3
keywords: def2-TZVPP
keywords: def2/J RIJCOSX GRIDX6 NOFINALGRIDX
keywords: grid4 nofinalgrid
keywords: scfconv7
keywords: smallprint printgap noloewdin
keywords: NOSOSCF
formula: C14H15Cl2N3O2
InChI: InChI=1/C14H15Cl2N3O2/c1-2-11-6-20-14(21-11,7-19-9-17-8-18-19)12-4-3-10(15)5-13(12)16/h3-5,8-9,11H,2,6-7H2,1H3
36 atoms
Cl 1.128045 0.118038 -2.322649
Cl 4.11138 -3.721794 -0.150053
O  -1.266922 0.255243 -0.58409
O  -1.053784 0.044932 1.629918
N  -0.828757 2.716388 0.718582
N  -1.274593 3.438005 -0.313911
N  -2.455271 3.905373 1.53419
C  -0.347638 0.321469 0.44704
C  -2.241904 -0.702147 -0.22257
C  -2.29568 -0.547942 1.298649
C  0.214409 1.743396 0.554939
C  0.785097 -0.689618 0.267959
C  -3.539714 -0.435641 -0.963595
C  -4.046964 0.996963 -0.873732
C  1.481055 -0.843369 -0.931148
C  1.171319 -1.494408 1.335364
C  2.502099 -1.772836 -1.064382
C  2.187914 -2.427481 1.22689
C  -1.548833 3.005027 1.813643
C  2.846273 -2.563139 0.017675
C  -2.245501 4.135764 0.220371
H  -1.884502 -1.710547 -0.476016
H  -3.107339 0.107551 1.626078
H  -2.403632 -1.510482 1.803807
H  0.776318 2.007218 -0.337901
H  0.894719 1.786042 1.406744
H  -4.288462 -1.132678 -0.575484
H  -3.399155 -0.705893 -2.012439
H  -4.220191 1.319656 0.153457
H  -3.343418 1.695864 -1.320674
H  -4.994509 1.091353 -1.402945
H  0.658198 -1.392418 2.280818
H  3.020752 -1.87547 -2.006877
H  2.461095 -3.04157 2.073246
H  -1.372025 2.549109 2.77478
H  -2.821842 4.841929 -0.356474
totalener: -1777.70128722 hartree
nucrepener: 2037.60703371 hartree
electener: -3815.30832093 hartree
oneelecener: -6488.61495183 hartree
twoeener: 2673.30663090 hartree
kineticenergy: 1772.81487472 hartree
xcener: -124.640052041294 hartree
chargesum: -0.0000000
charge: -0.045729 -0.063967 -0.332216 -0.382212 0.123574 -0.300761 -0.326885 0.564178 0.133304 -0.025160 -0.123334 -0.143938 -0.114254 -0.262601 -0.017721 -0.120940 -0.158051 -0.170390 0.019920 0.113464 0.050299 0.085380 0.091169 0.092717 0.133891 0.125847 0.061462 0.075682 0.070849 0.098156 0.092794 0.138770 0.114176 0.125125 0.146073 0.131331
qa: -0.0457 -0.0640 -0.3322 -0.3822 0.1236 -0.3008 -0.3269 0.5642 0.1333 -0.0252 -0.1233 -0.1439 -0.1143 -0.2626 -0.0177 -0.1209 -0.1581 -0.1704 0.0199 0.1135 0.0503 0.0854 0.0912 0.0927 0.1339 0.1258 0.0615 0.0757 0.0708 0.0982 0.0928 0.1388 0.1142 0.1251 0.1461 0.1313
va: 1.2765 1.2414 2.0375 1.9687 3.3526 2.8593 3.0512 3.8627 3.8877 3.9580 3.8183 3.6182 3.9259 3.9393 4.0559 3.9443 4.0801 4.0625 4.0792 3.9199 4.0378 0.9966 1.0007 1.0012 1.0356 1.0050 1.0088 1.0077 1.0105 1.0162 1.0069 1.0288 1.0289 1.0147 1.0102 1.0029
dispcorr: -0.021374046 hartree
energy: -1777.722661263485
dipole: -29.61533 29.61432 -0.00102 8.44372 -9.72266 -1.27893 6.83977 -6.35003 0.48974
magnitude: 1.36949 au
magnitude: 3.48097 debye
