program: Orca
programVersion: 4.2.1
elementType: Cl Cl O O N N N C C C C C C C C C C C C C C H H H H H H H H H H H H H H H
charge: 0
multiplicity: 1
keywords: wb97x-d3
keywords: def2-TZVPP
keywords: def2/J RIJCOSX GRIDX6 NOFINALGRIDX
keywords: grid4 nofinalgrid
keywords: scfconv7
keywords: smallprint printgap noloewdin
keywords: NOSOSCF
formula: C14H15Cl2N3O2
InChI: InChI=1/C14H15Cl2N3O2/c1-2-11-6-20-14(21-11,7-19-9-17-8-18-19)12-4-3-10(15)5-13(12)16/h3-5,8-9,11H,2,6-7H2,1H3
36 atoms
Cl 2.367608 -0.428933 1.530029
Cl 2.714492 4.630715 -0.093138
O  -1.62579 -0.379566 -0.576665
O  -0.493392 -1.121726 1.201107
N  -0.333828 -2.865588 -1.014267
N  0.006728 -3.881147 -0.216357
N  -1.842369 -4.385712 -1.384383
C  -0.334154 -0.594676 -0.079143
C  -2.566676 -0.409887 0.500478
C  -1.665668 -0.524638 1.722722
C  0.364637 -1.60824 -0.988171
C  0.453811 0.715704 -0.060097
C  -3.459098 0.811869 0.499216
C  -4.322382 0.931818 -0.74634
C  1.654191 0.869515 0.632672
C  -0.007956 1.81333 -0.780214
C  2.353276 2.067286 0.630008
C  0.670578 3.020077 -0.804143
C  -1.440376 -3.176603 -1.690561
C  1.848826 3.135989 -0.089303
C  -0.91916 -4.763974 -0.480347
H  -3.177014 -1.313631 0.386932
H  -1.449638 0.45871 2.159072
H  -2.073617 -1.167168 2.500883
H  1.385376 -1.795328 -0.664465
H  0.410465 -1.204043 -1.998858
H  -4.099793 0.746408 1.383276
H  -2.848454 1.710234 0.627187
H  -3.719686 1.046151 -1.647692
H  -4.95381 0.051602 -0.878141
H  -4.978678 1.79941 -0.680779
H  -0.926782 1.732498 -1.342628
H  3.278159 2.159605 1.181801
H  0.279024 3.851696 -1.372546
H  -1.90134 -2.513521 -2.403973
H  -0.927245 -5.730425 -0.001424
elementType: Cl O N C H
totalener: -1777.71921931 hartree
nucrepener: 2023.31409018 hartree
electener: -3801.03330949 hartree
oneelecener: -6460.08780945 hartree
twoeener: 2659.05449996 hartree
cpcmener: -0.02867777 hartree
kineticenergy: 1772.83358318 hartree
xcener: -124.642748379511 hartree
chargesum: -0.0000000
charge: -0.074366 -0.083519 -0.402982 -0.362068 0.125891 -0.355546 -0.421344 0.574605 0.124590 0.020050 -0.095820 -0.107743 -0.137503 -0.263683 -0.010618 -0.165681 -0.157001 -0.186210 0.060747 0.119189 0.058511 0.084783 0.084575 0.120956 0.132285 0.144745 0.085539 0.064414 0.081355 0.081722 0.094141 0.163572 0.122372 0.147286 0.169844 0.162915
qa: -0.0744 -0.0835 -0.4030 -0.3621 0.1259 -0.3555 -0.4213 0.5746 0.1246 0.0200 -0.0958 -0.1077 -0.1375 -0.2637 -0.0106 -0.1657 -0.1570 -0.1862 0.0607 0.1192 0.0585 0.0848 0.0846 0.1210 0.1323 0.1447 0.0855 0.0644 0.0814 0.0817 0.0941 0.1636 0.1224 0.1473 0.1698 0.1629
va: 1.2462 1.2209 1.9724 2.0000 3.3733 2.8869 3.0230 3.9026 3.9048 3.9256 3.7809 3.5297 3.9384 3.9297 3.9964 3.9576 4.0866 4.0601 4.0663 3.8523 4.0528 1.0030 1.0058 0.9954 1.0326 1.0045 1.0105 1.0078 1.0073 1.0021 1.0042 1.0084 1.0261 1.0064 1.0037 0.9948
dispcorr: -0.020335869 hartree
energy: -1777.739555179180
dipole: -31.02907 30.06494 -0.96413 -5.75243 7.74796 1.99553 -4.53987 4.26888 -0.27098
magnitude: 2.23274 au
magnitude: 5.67517 debye
