program: Orca
programVersion: 4.2.1
elementType: Cl Cl O O N N N C C C C C C C C C C C C C C H H H H H H H H H H H H H H H
charge: 0
multiplicity: 1
keywords: wb97x-d3
keywords: def2-TZVPP
keywords: def2/J RIJCOSX GRIDX6 NOFINALGRIDX
keywords: grid4 nofinalgrid
keywords: scfconv7
keywords: smallprint printgap noloewdin
keywords: NOSOSCF
formula: C14H15Cl2N3O2
InChI: InChI=1/C14H15Cl2N3O2/c1-2-11-6-20-14(21-11,7-19-9-17-8-18-19)12-4-3-10(15)5-13(12)16/h3-5,8-9,11H,2,6-7H2,1H3
36 atoms
Cl 2.109067 -0.323383 1.798415
Cl 2.866778 4.565172 -0.170868
O  -1.503977 -0.391358 -0.905947
O  -0.688335 -0.988541 1.087534
N  -0.223673 -2.934414 -0.888251
N  -0.028622 -3.857261 0.057236
N  -1.685932 -4.482712 -1.321022
C  -0.313017 -0.581279 -0.191049
C  -2.607032 -0.327161 0.001254
C  -1.917852 -0.342743 1.360507
C  0.488134 -1.68425 -0.88666
C  0.501007 0.71253 -0.160845
C  -3.46435 0.894322 -0.255116
C  -4.677405 0.9246 0.663734
C  1.585303 0.904047 0.694967
C  0.190143 1.751408 -1.032963
C  2.314622 2.083506 0.700841
C  0.903346 2.938254 -1.052302
C  -1.218271 -3.315856 -1.690917
C  1.961423 3.094117 -0.175456
C  -0.920538 -4.761007 -0.24909
H  -3.208056 -1.234284 -0.133471
H  -1.755546 0.673131 1.743457
H  -2.453011 -0.916235 2.114972
H  1.449508 -1.845167 -0.405481
H  0.683999 -1.383272 -1.915278
H  -2.864274 1.797918 -0.11459
H  -3.795727 0.889761 -1.295847
H  -5.294187 0.033451 0.536933
H  -4.393399 0.983964 1.715884
H  -5.302959 1.790339 0.448774
H  -0.633648 1.639781 -1.722658
H  3.146255 2.206563 1.380229
H  0.630329 3.724085 -1.742202
H  -1.550833 -2.735053 -2.535783
H  -1.022096 -5.668067 0.325779
elementType: Cl O N C H
totalener: -1777.71944224 hartree
nucrepener: 2017.35581089 hartree
electener: -3795.07525313 hartree
oneelecener: -6448.20898999 hartree
twoeener: 2653.13373686 hartree
cpcmener: -0.02870507 hartree
kineticenergy: 1772.82965202 hartree
xcener: -124.642508060270 hartree
chargesum: 0.0000000
charge: -0.075011 -0.083499 -0.411423 -0.362102 0.125962 -0.352863 -0.420814 0.572863 0.141462 0.001984 -0.096564 -0.105547 -0.122784 -0.273640 -0.018174 -0.160609 -0.153697 -0.184802 0.056383 0.117874 0.057903 0.086073 0.089970 0.124839 0.132529 0.144555 0.062790 0.074696 0.087131 0.085128 0.096548 0.158110 0.122169 0.147792 0.172510 0.162257
qa: -0.0750 -0.0835 -0.4114 -0.3621 0.1260 -0.3529 -0.4208 0.5729 0.1415 0.0020 -0.0966 -0.1055 -0.1228 -0.2736 -0.0182 -0.1606 -0.1537 -0.1848 0.0564 0.1179 0.0579 0.0861 0.0900 0.1248 0.1325 0.1446 0.0628 0.0747 0.0871 0.0851 0.0965 0.1581 0.1222 0.1478 0.1725 0.1623
va: 1.2453 1.2208 1.9769 2.0011 3.3749 2.8878 3.0204 3.8938 3.8929 3.9047 3.7809 3.5444 3.9502 3.9532 4.0058 3.9555 4.0847 4.0577 4.0636 3.8575 4.0543 1.0036 1.0003 0.9913 1.0325 1.0055 1.0078 1.0098 1.0017 1.0005 1.0030 1.0187 1.0259 1.0064 1.0027 0.9950
dispcorr: -0.020075169 hartree
energy: -1777.739517408184
dipole: -31.50555 30.62469 -0.88086 -5.74153 7.69865 1.95712 -3.74804 3.11645 -0.63159
magnitude: 2.23722 au
magnitude: 5.68656 debye
