program: Orca
programVersion: 4.2.1
elementType: Cl Cl O O N N N C C C C C C C C C C C C C C H H H H H H H H H H H H H H H
charge: 0
multiplicity: 1
keywords: wb97x-d3
keywords: def2-TZVPP
keywords: def2/J RIJCOSX GRIDX6 NOFINALGRIDX
keywords: grid4 nofinalgrid
keywords: scfconv7
keywords: smallprint printgap noloewdin
keywords: NOSOSCF
formula: C14H15Cl2N3O2
InChI: InChI=1/C14H15Cl2N3O2/c1-2-11-6-20-14(21-11,7-19-9-17-8-18-19)12-4-3-10(15)5-13(12)16/h3-5,8-9,11H,2,6-7H2,1H3
36 atoms
Cl 0.576883 0.81733 -2.370222
Cl 2.872556 4.47778 0.73915
O  -1.317972 -0.567914 -0.601991
O  -0.755125 -0.999124 1.532964
N  -0.009943 -3.054449 -0.343387
N  -0.110453 -3.937153 0.654875
N  -1.416991 -4.545055 -1.065428
C  -0.235671 -0.684828 0.273245
C  -2.554784 -0.75522 0.080872
C  -2.122491 -1.351491 1.415853
C  0.700335 -1.811421 -0.20232
C  0.555002 0.614945 0.36143
C  -3.357933 0.531108 0.17525
C  -2.683487 1.683643 0.901632
C  0.943905 1.342798 -0.761537
C  0.928639 1.116905 1.604253
C  1.653866 2.529679 -0.655425
C  1.639963 2.296547 1.739655
C  -0.799419 -3.425885 -1.351962
C  1.992221 2.997871 0.600944
C  -0.955965 -4.808516 0.171923
H  -3.137153 -1.484565 -0.48801
H  -2.668289 -0.936543 2.264673
H  -2.247147 -2.437718 1.436127
H  1.507804 -1.951978 0.513404
H  1.152129 -1.562177 -1.16027
H  -3.629687 0.845312 -0.835457
H  -4.298519 0.277498 0.672219
H  -2.400525 1.427765 1.923783
H  -1.788331 2.022363 0.380961
H  -3.361251 2.535409 0.96218
H  0.654006 0.582692 2.501488
H  1.934606 3.077402 -1.543896
H  1.908281 2.658623 2.721879
H  -0.877899 -2.870277 -2.271944
H  -1.252411 -5.678094 0.736204
elementType: Cl O N C H
totalener: -1777.71565465 hartree
nucrepener: 2054.75505666 hartree
electener: -3832.47071131 hartree
oneelecener: -6522.95496653 hartree
twoeener: 2690.48425522 hartree
cpcmener: -0.02489408 hartree
kineticenergy: 1772.84132160 hartree
xcener: -124.648676271304 hartree
chargesum: -0.0000000
charge: -0.074428 -0.084631 -0.392858 -0.398248 0.131605 -0.364694 -0.409864 0.591883 0.191151 -0.018771 -0.134510 -0.123124 -0.143901 -0.277549 0.009573 -0.140415 -0.152405 -0.172760 0.057449 0.117147 0.060397 0.095077 0.098643 0.094995 0.128845 0.147917 0.068626 0.074655 0.084281 0.083529 0.105919 0.147481 0.121997 0.147911 0.167391 0.161687
qa: -0.0744 -0.0846 -0.3929 -0.3982 0.1316 -0.3647 -0.4099 0.5919 0.1912 -0.0188 -0.1345 -0.1231 -0.1439 -0.2775 0.0096 -0.1404 -0.1524 -0.1728 0.0574 0.1171 0.0604 0.0951 0.0986 0.0950 0.1288 0.1479 0.0686 0.0747 0.0843 0.0835 0.1059 0.1475 0.1220 0.1479 0.1674 0.1617
va: 1.2443 1.2193 1.9939 1.9761 3.3538 2.8683 3.0229 3.8207 3.8131 3.9687 3.8244 3.4940 3.9510 3.9425 3.9554 3.9269 4.0936 4.0382 4.0683 3.8528 4.0440 0.9988 1.0006 0.9974 1.0239 1.0139 1.0105 1.0092 1.0051 0.9968 1.0047 1.0275 1.0263 1.0054 1.0052 0.9965
dispcorr: -0.022238756 hartree
energy: -1777.737893407091
dipole: -21.93676 21.48281 -0.45395 -10.50195 11.45126 0.94931 9.29651 -8.85105 0.44546
magnitude: 1.14267 au
magnitude: 2.90445 debye
