program: Orca
programVersion: 4.2.1
elementType: Cl Cl O O N N N C C C C C C C C C C C C C C H H H H H H H H H H H H H H H
charge: 0
multiplicity: 1
keywords: wb97x-d3
keywords: def2-TZVPP
keywords: def2/J RIJCOSX GRIDX6 NOFINALGRIDX
keywords: grid4 nofinalgrid
keywords: scfconv7
keywords: smallprint printgap noloewdin
keywords: NOSOSCF
formula: C14H15Cl2N3O2
InChI: InChI=1/C14H15Cl2N3O2/c1-2-11-6-20-14(21-11,7-19-9-17-8-18-19)12-4-3-10(15)5-13(12)16/h3-5,8-9,11H,2,6-7H2,1H3
36 atoms
Cl 0.506219 0.019122 2.911613
Cl 3.691791 2.671093 -0.432009
O  -2.095692 -0.576182 -0.722699
O  -2.058497 -0.301528 1.489046
N  0.062763 -2.579645 -0.405187
N  1.37912 -2.552607 -0.177201
N  0.964967 -3.021605 -2.332231
C  -1.270227 -0.685912 0.40541
C  -3.148808 0.353696 -0.443555
C  -2.880332 0.747182 1.010189
C  -0.881966 -2.15628 0.596624
C  -0.032095 0.195615 0.235127
C  -3.15037 1.523836 -1.406443
C  -4.316236 2.462785 -1.129512
C  0.809005 0.543182 1.289447
C  0.338215 0.620841 -1.037348
C  1.948189 1.310081 1.096417
C  1.476148 1.375617 -1.263361
C  -0.165052 -2.844274 -1.692901
C  2.270099 1.72028 -0.184839
C  1.871383 -2.825343 -1.355912
H  -4.096561 -0.188035 -0.527329
H  -2.363877 1.712733 1.07919
H  -3.779747 0.792075 1.621279
H  -1.77554 -2.777249 0.537849
H  -0.426728 -2.312402 1.571647
H  -2.205869 2.068422 -1.324703
H  -3.216969 1.150523 -2.430655
H  -4.266302 2.892776 -0.127545
H  -4.320548 3.292313 -1.835839
H  -5.273614 1.947377 -1.220819
H  -0.274211 0.356892 -1.887227
H  2.575635 1.575674 1.935546
H  1.73057 1.687004 -2.266524
H  -1.154895 -2.919253 -2.113188
H  2.935293 -2.895575 -1.51899
elementType: Cl O N C H
totalener: -1777.71735132 hartree
nucrepener: 2068.35898756 hartree
electener: -3846.07633888 hartree
oneelecener: -6550.62776297 hartree
twoeener: 2704.55142409 hartree
cpcmener: -0.02653588 hartree
kineticenergy: 1772.82651277 hartree
xcener: -124.642973928566 hartree
chargesum: 0.0000000
charge: -0.074232 -0.085221 -0.404349 -0.368901 0.109593 -0.337289 -0.407896 0.596316 0.143359 -0.018097 -0.081001 -0.104146 -0.131101 -0.275722 -0.018923 -0.194029 -0.139966 -0.186232 0.057949 0.117872 0.059562 0.091838 0.092262 0.125306 0.133171 0.128979 0.064822 0.074703 0.084043 0.096792 0.088613 0.161500 0.120571 0.147945 0.170789 0.161123
qa: -0.0742 -0.0852 -0.4043 -0.3689 0.1096 -0.3373 -0.4079 0.5963 0.1434 -0.0181 -0.0810 -0.1041 -0.1311 -0.2757 -0.0189 -0.1940 -0.1400 -0.1862 0.0579 0.1179 0.0596 0.0918 0.0923 0.1253 0.1332 0.1290 0.0648 0.0747 0.0840 0.0968 0.0886 0.1615 0.1206 0.1479 0.1708 0.1611
va: 1.2470 1.2187 1.9781 2.0067 3.3661 2.8845 3.0301 3.8296 3.8973 3.9334 3.8316 3.4936 3.9360 3.9546 3.9962 3.8721 4.0846 4.0845 4.0698 3.8550 4.0448 1.0043 0.9979 0.9897 1.0175 1.0267 1.0052 1.0108 1.0019 1.0023 1.0017 1.0129 1.0254 1.0050 1.0065 0.9965
dispcorr: -0.021703068 hartree
energy: -1777.739054385792
dipole: -30.14384 27.73114 -2.41270 2.26145 -1.31300 0.94846 -11.45912 11.39434 -0.06478
magnitude: 2.59324 au
magnitude: 6.59150 debye
