program: Orca
programVersion: 4.2.1
elementType: Cl Cl O O N N N C C C C C C C C C C C C C C H H H H H H H H H H H H H H H
charge: 0
multiplicity: 1
keywords: wb97x-d3
keywords: def2-TZVPP
keywords: def2/J RIJCOSX GRIDX6 NOFINALGRIDX
keywords: grid4 nofinalgrid
keywords: scfconv7
keywords: smallprint printgap noloewdin
keywords: NOSOSCF
formula: C14H15Cl2N3O2
InChI: InChI=1/C14H15Cl2N3O2/c1-2-11-6-20-14(21-11,7-19-9-17-8-18-19)12-4-3-10(15)5-13(12)16/h3-5,8-9,11H,2,6-7H2,1H3
36 atoms
Cl -0.011391 1.070042 -2.255247
Cl 2.80839 4.437099 0.756472
O  -1.395748 -0.676975 -0.292911
O  -0.345044 -1.358955 1.541751
N  0.029221 -3.110738 -0.629633
N  0.244391 -4.08025 0.262743
N  -1.369259 -4.680901 -1.175337
C  -0.129056 -0.828678 0.269237
C  -2.327006 -0.409481 0.754664
C  -1.555856 -0.801182 2.023552
C  0.685053 -1.834039 -0.545553
C  0.618993 0.503467 0.349147
C  -2.796989 1.033019 0.766215
C  -3.52728 1.447527 -0.499639
C  0.699285 1.404673 -0.711337
C  1.27254 0.850851 1.527615
C  1.368666 2.613619 -0.595554
C  1.948208 2.050362 1.672449
C  -0.93841 -3.479325 -1.468504
C  1.982216 2.928063 0.604129
C  -0.610716 -4.99445 -0.108674
H  -3.18374 -1.069367 0.593602
H  -1.362236 0.068946 2.660072
H  -2.071317 -1.553164 2.618822
H  1.663113 -1.975954 -0.089601
H  0.848756 -1.459301 -1.554165
H  -3.461181 1.145984 1.628137
H  -1.947139 1.697529 0.946902
H  -4.38824 0.804858 -0.691511
H  -3.893652 2.470837 -0.417041
H  -2.874932 1.402592 -1.371256
H  1.254284 0.171075 2.367526
H  1.408852 3.296559 -1.432396
H  2.436009 2.289591 2.606679
H  -1.282124 -2.859284 -2.280237
H  -0.686159 -5.93751 0.408968
elementType: Cl O N C H
totalener: -1777.71830946 hartree
nucrepener: 2043.01376048 hartree
electener: -3820.73206994 hartree
oneelecener: -6499.38873285 hartree
twoeener: 2678.65666291 hartree
cpcmener: -0.02776272 hartree
kineticenergy: 1772.84516013 hartree
xcener: -124.646540907706 hartree
chargesum: 0.0000000
charge: -0.079293 -0.083051 -0.381683 -0.381810 0.130538 -0.358146 -0.422868 0.602979 0.216197 -0.046337 -0.115562 -0.163960 -0.165451 -0.278410 -0.014132 -0.130727 -0.137850 -0.187063 0.069818 0.112286 0.058584 0.098785 0.096364 0.111272 0.132461 0.149464 0.088614 0.066392 0.084551 0.094819 0.079523 0.154136 0.122314 0.148444 0.165965 0.162835
qa: -0.0793 -0.0831 -0.3817 -0.3818 0.1305 -0.3581 -0.4229 0.6030 0.2162 -0.0463 -0.1156 -0.1640 -0.1655 -0.2784 -0.0141 -0.1307 -0.1379 -0.1871 0.0698 0.1123 0.0586 0.0988 0.0964 0.1113 0.1325 0.1495 0.0886 0.0664 0.0846 0.0948 0.0795 0.1541 0.1223 0.1484 0.1660 0.1628
va: 1.2369 1.2211 1.9883 1.9914 3.3575 2.8950 3.0285 3.8364 3.7968 3.9584 3.7769 3.5337 3.9404 3.9332 3.9818 3.9379 4.0833 4.0510 4.0700 3.8601 4.0554 0.9983 0.9964 1.0010 1.0229 1.0149 1.0115 0.9992 1.0016 1.0046 1.0166 1.0188 1.0251 1.0059 1.0041 0.9948
dispcorr: -0.021034348 hartree
energy: -1777.739343806624
dipole: -20.18983 20.00087 -0.18896 -8.92444 10.59447 1.67003 7.65314 -6.84577 0.80737
magnitude: 1.86455 au
magnitude: 4.73932 debye
