program: Orca
programVersion: 4.2.1
elementType: Cl Cl O O N N N C C C C C C C C C C C C C C H H H H H H H H H H H H H H H
charge: 0
multiplicity: 1
keywords: wb97x-d3
keywords: def2-TZVPP
keywords: def2/J RIJCOSX GRIDX6 NOFINALGRIDX
keywords: grid4 nofinalgrid
keywords: scfconv7
keywords: smallprint printgap noloewdin
keywords: NOSOSCF
formula: C14H15Cl2N3O2
InChI: InChI=1/C14H15Cl2N3O2/c1-2-11-6-20-14(21-11,7-19-9-17-8-18-19)12-4-3-10(15)5-13(12)16/h3-5,8-9,11H,2,6-7H2,1H3
36 atoms
Cl -0.333669 1.034582 -2.540577
Cl 3.890614 2.504415 0.353536
O  -2.368971 0.214924 -0.567263
O  -1.706905 -0.853589 1.297284
N  0.0393 -2.535631 -0.401749
N  1.222721 -2.364196 -0.999907
N  1.459228 -3.579607 0.871424
C  -1.320622 -0.525368 -0.004811
C  -3.487959 0.240193 0.321515
C  -3.122499 -0.829469 1.341668
C  -1.130163 -1.814207 -0.833271
C  -0.027601 0.270746 0.066304
C  -3.718944 1.632616 0.885327
C  -2.566221 2.22576 1.680583
C  0.481757 0.984514 -1.014684
C  0.730198 0.255391 1.233646
C  1.679417 1.678859 -0.935001
C  1.934495 0.929275 1.338015
C  0.201212 -3.246398 0.716181
C  2.395549 1.643969 0.247712
C  2.03387 -3.009434 -0.204726
H  -4.374112 -0.060175 -0.242734
H  -3.434988 -0.594299 2.358814
H  -3.543397 -1.803575 1.071231
H  -1.015664 -1.589103 -1.890389
H  -2.007544 -2.454008 -0.72732
H  -3.970507 2.299966 0.056977
H  -4.615272 1.58044 1.509438
H  -1.669538 2.33757 1.070872
H  -2.835089 3.218572 2.04214
H  -2.305139 1.626254 2.553306
H  0.381371 -0.295452 2.09438
H  2.046392 2.233674 -1.787113
H  2.497075 0.894047 2.260189
H  -0.614971 -3.516529 1.366571
H  3.089836 -3.077307 -0.414066
elementType: Cl O N C H
totalener: -1777.71519420 hartree
nucrepener: 2085.98749828 hartree
electener: -3863.70269248 hartree
oneelecener: -6586.19433529 hartree
twoeener: 2722.49164282 hartree
cpcmener: -0.02837197 hartree
kineticenergy: 1772.82696611 hartree
xcener: -124.644015448554 hartree
chargesum: -0.0000000
charge: -0.074058 -0.086253 -0.390974 -0.388666 0.116166 -0.334443 -0.409034 0.549356 0.171886 -0.004916 -0.143889 -0.122595 -0.135654 -0.272140 0.047683 -0.129731 -0.155824 -0.189111 0.058434 0.125781 0.057473 0.096251 0.102764 0.095807 0.130371 0.132760 0.068692 0.071056 0.081126 0.103722 0.081223 0.147790 0.120170 0.147897 0.170456 0.160425
qa: -0.0741 -0.0863 -0.3910 -0.3887 0.1162 -0.3344 -0.4090 0.5494 0.1719 -0.0049 -0.1439 -0.1226 -0.1357 -0.2721 0.0477 -0.1297 -0.1558 -0.1891 0.0584 0.1258 0.0575 0.0963 0.1028 0.0958 0.1304 0.1328 0.0687 0.0711 0.0811 0.1037 0.0812 0.1478 0.1202 0.1479 0.1705 0.1604
va: 1.2465 1.2178 2.0140 1.9548 3.3530 2.8896 3.0314 3.8789 3.9002 3.9551 3.9456 3.4672 3.9234 3.9439 3.9357 3.8509 4.1144 4.0703 4.0743 3.8388 4.0459 0.9982 0.9962 0.9999 1.0277 1.0018 1.0108 1.0117 1.0000 1.0045 1.0059 1.0254 1.0261 1.0045 1.0043 0.9970
dispcorr: -0.022618425 hartree
energy: -1777.737812624320
dipole: -25.99553 23.18012 -2.81541 -4.14364 4.11607 -0.02757 13.69654 -12.81684 0.87970
magnitude: 2.94978 au
magnitude: 7.49774 debye
