program: Orca
programVersion: 4.2.1
elementType: Cl Cl O O N N N C C C C C C C C C C C C C C H H H H H H H H H H H H H H H
charge: 0
multiplicity: 1
keywords: wb97x-d3
keywords: def2-TZVPP
keywords: def2/J RIJCOSX GRIDX6 NOFINALGRIDX
keywords: grid4 nofinalgrid
keywords: scfconv7
keywords: smallprint printgap noloewdin
keywords: NOSOSCF
formula: C14H15Cl2N3O2
InChI: InChI=1/C14H15Cl2N3O2/c1-2-11-6-20-14(21-11,7-19-9-17-8-18-19)12-4-3-10(15)5-13(12)16/h3-5,8-9,11H,2,6-7H2,1H3
36 atoms
Cl 0.380287 1.085249 -2.187896
Cl 3.349984 4.208399 0.94448
O  -1.32526 -0.403274 -0.337218
O  -0.535111 -1.151188 1.62426
N  -0.1857 -2.971366 -0.531463
N  -0.826106 -3.159791 -1.686991
N  -1.362269 -4.767686 -0.224179
C  -0.152949 -0.687102 0.363004
C  -2.456624 -0.581202 0.509409
C  -1.827099 -0.637345 1.890859
C  0.639446 -1.813748 -0.312096
C  0.718982 0.561595 0.476896
C  -3.45332 0.54099 0.319464
C  -4.022903 0.610816 -1.088513
C  0.997815 1.40016 -0.601701
C  1.303771 0.880603 1.698468
C  1.802879 2.52139 -0.466357
C  2.110825 1.993965 1.862205
C  -0.519576 -3.933274 0.333992
C  2.349277 2.810447 0.771589
C  -1.515124 -4.247159 -1.458757
H  -2.934875 -1.539978 0.269206
H  -1.772473 0.355787 2.35395
H  -2.340045 -1.312404 2.574465
H  1.486966 -2.087903 0.316527
H  1.033601 -1.496569 -1.274754
H  -4.26423 0.384354 1.03701
H  -2.982159 1.491856 0.584799
H  -3.248439 0.829015 -1.8242
H  -4.499098 -0.329209 -1.374292
H  -4.777322 1.394579 -1.163311
H  1.126193 0.246128 2.555569
H  1.999005 3.156843 -1.318921
H  2.543707 2.213646 2.82817
H  -0.123313 -3.989737 1.335277
H  -2.14743 -4.688363 -2.213836
elementType: Cl O N C H
totalener: -1777.72736480 hartree
nucrepener: 2029.77095444 hartree
electener: -3807.49831924 hartree
oneelecener: -6473.20773347 hartree
twoeener: 2665.70941424 hartree
cpcmener: -0.02365261 hartree
kineticenergy: 1772.80758418 hartree
xcener: -124.637210799438 hartree
chargesum: -0.0000000
charge: -0.073194 -0.083276 -0.349846 -0.385913 0.117184 -0.337692 -0.410007 0.578132 0.138938 -0.014303 -0.114126 -0.081249 -0.122573 -0.260863 -0.054232 -0.133945 -0.142845 -0.186411 0.058471 0.113328 0.050981 0.079235 0.091456 0.117387 0.139832 0.134133 0.074495 0.058467 0.081409 0.077743 0.092956 0.150988 0.121984 0.145618 0.167984 0.159752
qa: -0.0732 -0.0833 -0.3498 -0.3859 0.1172 -0.3377 -0.4100 0.5781 0.1389 -0.0143 -0.1141 -0.0812 -0.1226 -0.2609 -0.0542 -0.1339 -0.1428 -0.1864 0.0585 0.1133 0.0510 0.0792 0.0915 0.1174 0.1398 0.1341 0.0745 0.0585 0.0814 0.0777 0.0930 0.1510 0.1220 0.1456 0.1680 0.1598
va: 1.2440 1.2207 2.0250 1.9835 3.3866 2.8902 3.0301 3.8527 3.8859 3.9497 3.8041 3.5913 3.9447 3.9284 4.0424 3.9178 4.0766 4.0485 4.0678 3.8633 4.0533 0.9972 1.0022 0.9996 1.0089 1.0285 1.0111 1.0141 1.0118 1.0036 1.0039 1.0223 1.0254 1.0071 1.0041 0.9962
dispcorr: -0.020316377 hartree
energy: -1777.747681174802
dipole: -24.64909 24.71248 0.06339 -12.15019 12.98599 0.83580 6.11763 -4.36633 1.75130
magnitude: 1.94156 au
magnitude: 4.93504 debye
