program: Orca
programVersion: 4.2.1
elementType: Cl Cl O O N N N C C C C C C C C C C C C C C H H H H H H H H H H H H H H H
charge: 0
multiplicity: 1
keywords: wb97x-d3
keywords: def2-TZVPP
keywords: def2/J RIJCOSX GRIDX6 NOFINALGRIDX
keywords: grid4 nofinalgrid
keywords: scfconv7
keywords: smallprint printgap noloewdin
keywords: NOSOSCF
formula: C14H15Cl2N3O2
InChI: InChI=1/C14H15Cl2N3O2/c1-2-11-6-20-14(21-11,7-19-9-17-8-18-19)12-4-3-10(15)5-13(12)16/h3-5,8-9,11H,2,6-7H2,1H3
36 atoms
Cl 0.334794 1.156259 -2.192977
Cl 3.447672 4.164774 0.911856
O  -1.343994 -0.336231 -0.323666
O  -0.515754 -1.134537 1.605688
N  -0.220091 -2.941423 -0.544505
N  -0.961666 -3.113344 -1.640509
N  -1.350925 -4.753735 -0.167414
C  -0.1597 -0.652944 0.341308
C  -2.462443 -0.644422 0.501295
C  -1.833944 -0.696704 1.881508
C  0.606697 -1.77876 -0.369042
C  0.731835 0.580323 0.453083
C  -3.548378 0.396313 0.340051
C  -4.107343 0.47197 -1.072339
C  0.997889 1.43208 -0.618408
C  1.354715 0.866212 1.664055
C  1.827404 2.535694 -0.484831
C  2.189064 1.959677 1.82436
C  -0.468167 -3.92216 0.328934
C  2.414129 2.790918 0.742028
C  -1.619093 -4.211707 -1.372989
H  -2.859385 -1.630592 0.224109
H  -1.832835 0.288057 2.364616
H  -2.310328 -1.412945 2.549455
H  1.48099 -2.04942 0.222695
H  0.956836 -1.459781 -1.347655
H  -4.350195 0.142561 1.039541
H  -3.163374 1.372734 0.647452
H  -4.497981 -0.493287 -1.399883
H  -4.925384 1.190775 -1.127274
H  -3.347199 0.783974 -1.788517
H  1.186044 0.21971 2.513815
H  2.011577 3.18349 -1.330833
H  2.654026 2.153279 2.781032
H  0.017621 -3.993526 1.28913
H  -2.315234 -4.643315 -2.075544
elementType: Cl O N C H
totalener: -1777.72746960 hartree
nucrepener: 2028.68146258 hartree
electener: -3806.40893217 hartree
oneelecener: -6471.04397395 hartree
twoeener: 2664.63504178 hartree
cpcmener: -0.02339018 hartree
kineticenergy: 1772.80662282 hartree
xcener: -124.637364949937 hartree
chargesum: 0.0000000
charge: -0.072857 -0.083187 -0.347971 -0.392056 0.113921 -0.339848 -0.407833 0.577442 0.128249 -0.001698 -0.115813 -0.069621 -0.121342 -0.258273 -0.053624 -0.132106 -0.143353 -0.185032 0.057753 0.112409 0.051628 0.074377 0.089675 0.116197 0.138034 0.134867 0.073312 0.058373 0.076838 0.093638 0.081682 0.150063 0.121938 0.145277 0.169602 0.159340
qa: -0.0729 -0.0832 -0.3480 -0.3921 0.1139 -0.3398 -0.4078 0.5774 0.1282 -0.0017 -0.1158 -0.0696 -0.1213 -0.2583 -0.0536 -0.1321 -0.1434 -0.1850 0.0578 0.1124 0.0516 0.0744 0.0897 0.1162 0.1380 0.1349 0.0733 0.0584 0.0768 0.0936 0.0817 0.1501 0.1219 0.1453 0.1696 0.1593
va: 1.2445 1.2209 2.0298 1.9791 3.3896 2.8862 3.0303 3.8415 3.9100 3.9490 3.8126 3.6013 3.9447 3.9265 4.0453 3.9176 4.0756 4.0472 4.0659 3.8635 4.0506 0.9965 1.0031 0.9994 1.0089 1.0281 1.0107 1.0163 1.0041 1.0038 1.0116 1.0235 1.0252 1.0072 1.0025 0.9969
dispcorr: -0.020312413 hartree
energy: -1777.747782008482
dipole: -25.04198 25.14337 0.10138 -13.06858 13.77918 0.71060 6.12082 -4.46904 1.65178
magnitude: 1.80101 au
magnitude: 4.57779 debye
