program: Orca
programVersion: 4.2.1
elementType: Cl Cl O O N N N C C C C C C C C C C C C C C H H H H H H H H H H H H H H H
charge: 0
multiplicity: 1
keywords: wb97x-d3
keywords: def2-TZVPP
keywords: def2/J RIJCOSX GRIDX6 NOFINALGRIDX
keywords: grid4 nofinalgrid
keywords: scfconv7
keywords: smallprint printgap noloewdin
keywords: NOSOSCF
formula: C14H15Cl2N3O2
InChI: InChI=1/C14H15Cl2N3O2/c1-2-11-6-20-14(21-11,7-19-9-17-8-18-19)12-4-3-10(15)5-13(12)16/h3-5,8-9,11H,2,6-7H2,1H3
36 atoms
Cl 2.330433 -0.629158 1.391066
Cl 2.894371 4.545158 0.26178
O  -1.699557 -0.169212 -0.583615
O  -0.562308 -1.14029 1.088214
N  -0.507814 -2.712757 -1.200587
N  -1.578767 -2.873869 -1.981207
N  -1.265966 -4.681333 -0.695835
C  -0.415322 -0.501734 -0.142711
C  -2.659836 -0.507688 0.415044
C  -1.78624 -0.696374 1.642536
C  0.220497 -1.474275 -1.146452
C  0.437327 0.76012 -0.022241
C  -3.715153 0.568308 0.541369
C  -4.519819 0.777711 -0.732086
C  1.66263 0.784819 0.643774
C  0.0096 1.947226 -0.608803
C  2.421474 1.941886 0.737498
C  0.748525 3.115904 -0.534211
C  -0.340479 -3.792415 -0.432545
C  1.952566 3.101542 0.146211
C  -1.995886 -4.068289 -1.649658
H  -3.136419 -1.456418 0.137121
H  -1.655753 0.2417 2.197426
H  -2.158729 -1.456696 2.327905
H  1.253039 -1.694315 -0.88121
H  0.225817 -1.024138 -2.138042
H  -4.386068 0.271729 1.352986
H  -3.246702 1.506553 0.852746
H  -5.311823 1.510535 -0.574484
H  -3.896925 1.141456 -1.549932
H  -4.993111 -0.149266 -1.062209
H  -0.930109 1.969279 -1.141332
H  3.364704 1.933832 1.265969
H  0.382644 4.020004 -1.000548
H  0.461845 -3.886296 0.282353
H  -2.859892 -4.518036 -2.11414
elementType: Cl O N C H
totalener: -1777.72745856 hartree
nucrepener: 2022.32284777 hartree
electener: -3800.05030633 hartree
oneelecener: -6458.15914369 hartree
twoeener: 2658.10883736 hartree
cpcmener: -0.02293813 hartree
kineticenergy: 1772.80925501 hartree
xcener: -124.638505766779 hartree
chargesum: 0.0000000
charge: -0.074206 -0.082202 -0.379994 -0.367284 0.132900 -0.356805 -0.410627 0.572583 0.104420 0.032749 -0.133119 -0.079696 -0.126218 -0.262356 -0.021220 -0.151414 -0.154429 -0.178896 0.066320 0.115256 0.060001 0.075814 0.081763 0.116985 0.143996 0.132383 0.078897 0.061154 0.093727 0.083872 0.079720 0.155653 0.122001 0.144687 0.163511 0.160075
qa: -0.0742 -0.0822 -0.3800 -0.3673 0.1329 -0.3568 -0.4106 0.5726 0.1044 0.0327 -0.1331 -0.0797 -0.1262 -0.2624 -0.0212 -0.1514 -0.1544 -0.1789 0.0663 0.1153 0.0600 0.0758 0.0818 0.1170 0.1440 0.1324 0.0789 0.0612 0.0937 0.0839 0.0797 0.1557 0.1220 0.1447 0.1635 0.1601
va: 1.2455 1.2217 2.0043 1.9884 3.3652 2.8869 3.0322 3.8860 3.9477 3.9233 3.8154 3.5370 3.9343 3.9312 4.0037 3.9599 4.0831 4.0491 4.0734 3.8589 4.0426 1.0043 1.0079 0.9973 1.0166 1.0218 1.0106 1.0135 1.0037 1.0070 1.0031 1.0138 1.0259 1.0073 1.0029 0.9961
dispcorr: -0.020268296 hartree
energy: -1777.747726855263
dipole: -31.56301 31.24972 -0.31330 -6.68300 8.00322 1.32022 -4.03199 4.58543 0.55344
magnitude: 1.46542 au
magnitude: 3.72479 debye
