program: Orca
programVersion: 4.2.1
elementType: Cl Cl O O N N N C C C C C C C C C C C C C C H H H H H H H H H H H H H H H
charge: 0
multiplicity: 1
keywords: wb97x-d3
keywords: def2-TZVPP
keywords: def2/J RIJCOSX GRIDX6 NOFINALGRIDX
keywords: grid4 nofinalgrid
keywords: scfconv7
keywords: smallprint printgap noloewdin
keywords: NOSOSCF
formula: C14H15Cl2N3O2
InChI: InChI=1/C14H15Cl2N3O2/c1-2-11-6-20-14(21-11,7-19-9-17-8-18-19)12-4-3-10(15)5-13(12)16/h3-5,8-9,11H,2,6-7H2,1H3
36 atoms
Cl 0.625959 0.856454 -2.285487
Cl 2.926013 4.364841 0.997008
O  -1.238945 -0.652584 -0.590658
O  -0.727365 -1.16564 1.506842
N  0.040201 -3.125697 -0.428229
N  -0.354566 -3.454771 -1.659454
N  -1.087335 -4.960296 -0.173506
C  -0.168746 -0.785067 0.28633
C  -2.401303 -0.288655 0.147052
C  -1.978816 -0.509652 1.607467
C  0.761634 -1.907506 -0.176024
C  0.619272 0.51836 0.429691
C  -2.844564 1.131671 -0.152735
C  -4.147947 1.474523 0.553816
C  0.995653 1.307535 -0.656211
C  1.012418 0.947855 1.693775
C  1.704512 2.488143 -0.49096
C  1.718588 2.122584 1.888659
C  -0.408434 -4.027668 0.448631
C  2.053456 2.888674 0.786607
C  -1.023174 -4.559694 -1.459078
H  -3.196065 -0.984897 -0.138639
H  -1.878908 0.438225 2.149541
H  -2.662378 -1.150541 2.162996
H  1.517469 -2.083129 0.589552
H  1.28079 -1.633488 -1.091548
H  -2.061163 1.834547 0.14647
H  -2.972921 1.243719 -1.231751
H  -4.057672 1.413602 1.640385
H  -4.462537 2.490516 0.315538
H  -4.95401 0.802803 0.252917
H  0.75946 0.353341 2.560768
H  1.978643 3.08342 -1.350923
H  1.999093 2.428814 2.886731
H  -0.209288 -3.97304 1.506843
H  -1.479341 -5.103308 -2.271986
elementType: Cl O N C H
totalener: -1777.72679827 hartree
nucrepener: 2030.29505023 hartree
electener: -3808.02184850 hartree
oneelecener: -6474.11849008 hartree
twoeener: 2666.09664158 hartree
cpcmener: -0.02526373 hartree
kineticenergy: 1772.81662796 hartree
xcener: -124.640512955771 hartree
chargesum: 0.0000000
charge: -0.069731 -0.082008 -0.364205 -0.386366 0.120732 -0.345453 -0.415056 0.592122 0.205522 -0.062652 -0.098195 -0.162840 -0.132128 -0.273774 -0.023489 -0.134333 -0.143151 -0.191682 0.065029 0.119127 0.055352 0.094286 0.098992 0.120151 0.142831 0.133320 0.059151 0.066374 0.081025 0.095604 0.087779 0.154233 0.120961 0.145758 0.166523 0.160194
qa: -0.0697 -0.0820 -0.3642 -0.3864 0.1207 -0.3455 -0.4151 0.5921 0.2055 -0.0627 -0.0982 -0.1628 -0.1321 -0.2738 -0.0235 -0.1343 -0.1432 -0.1917 0.0650 0.1191 0.0554 0.0943 0.0990 0.1202 0.1428 0.1333 0.0592 0.0664 0.0810 0.0956 0.0878 0.1542 0.1210 0.1458 0.1665 0.1602
va: 1.2480 1.2220 2.0157 1.9833 3.3752 2.8865 3.0306 3.8546 3.8334 3.9278 3.7752 3.5727 3.9619 3.9542 3.9973 3.9320 4.0810 4.0555 4.0706 3.8566 4.0566 0.9995 0.9949 0.9968 1.0069 1.0300 1.0034 1.0160 1.0031 1.0027 1.0015 1.0191 1.0268 1.0069 1.0045 0.9954
dispcorr: -0.020444004 hartree
energy: -1777.747242272631
dipole: -24.11405 23.99424 -0.11981 -7.99560 9.36817 1.37257 9.20044 -7.47077 1.72967
magnitude: 2.21134 au
magnitude: 5.62079 debye
