program: Orca
programVersion: 4.2.1
elementType: Cl Cl O O N N N C C C C C C C C C C C C C C H H H H H H H H H H H H H H H
charge: 0
multiplicity: 1
keywords: wb97x-d3
keywords: def2-TZVPP
keywords: def2/J RIJCOSX GRIDX6 NOFINALGRIDX
keywords: grid4 nofinalgrid
keywords: scfconv7
keywords: smallprint printgap noloewdin
keywords: NOSOSCF
formula: C14H15Cl2N3O2
InChI: InChI=1/C14H15Cl2N3O2/c1-2-11-6-20-14(21-11,7-19-9-17-8-18-19)12-4-3-10(15)5-13(12)16/h3-5,8-9,11H,2,6-7H2,1H3
36 atoms
Cl 0.407609 0.894285 -2.219239
Cl 2.813563 4.412462 0.975873
O  -1.327591 -0.673946 -0.380903
O  -0.557674 -1.290083 1.611188
N  0.017172 -3.106937 -0.524315
N  -0.468266 -3.376186 -1.737485
N  -1.044197 -4.983239 -0.28934
C  -0.160321 -0.82083 0.358402
C  -2.399143 -0.369581 0.5077
C  -1.846243 -0.768755 1.884127
C  0.739332 -1.890104 -0.264878
C  0.603702 0.498785 0.482334
C  -2.82789 1.08478 0.440562
C  -3.334037 1.512913 -0.926162
C  0.877311 1.323678 -0.608133
C  1.069911 0.9151 1.725196
C  1.554259 2.525113 -0.466261
C  1.748709 2.110036 1.89721
C  -0.340957 -4.067419 0.331525
C  1.978124 2.911058 0.793333
C  -1.092325 -4.509194 -1.549963
H  -3.239255 -1.007903 0.219406
H  -1.786416 0.089942 2.561657
H  -2.437705 -1.544989 2.369556
H  1.567605 -2.093779 0.414119
H  1.164568 -1.553282 -1.206973
H  -3.620464 1.219106 1.183563
H  -2.003494 1.730715 0.757555
H  -2.555613 1.440506 -1.685648
H  -4.176298 0.898938 -1.251867
H  -3.674461 2.548865 -0.90434
H  0.899332 0.294894 2.594142
H  1.746614 3.147301 -1.329232
H  2.088955 2.404143 2.880217
H  -0.059611 -4.0662 1.372301
H  -1.597568 -5.019389 -2.355545
elementType: Cl O N C H
totalener: -1777.72654484 hartree
nucrepener: 2043.50517520 hartree
electener: -3821.23172005 hartree
oneelecener: -6500.59658149 hartree
twoeener: 2679.36486144 hartree
cpcmener: -0.02502144 hartree
kineticenergy: 1772.81548631 hartree
xcener: -124.640539720787 hartree
chargesum: 0.0000000
charge: -0.075267 -0.081804 -0.365132 -0.384445 0.120202 -0.344328 -0.415465 0.586477 0.213137 -0.047476 -0.103639 -0.163505 -0.166218 -0.273068 -0.018371 -0.122930 -0.142097 -0.191249 0.064815 0.116496 0.055454 0.099068 0.097747 0.107782 0.143865 0.134936 0.085449 0.066539 0.079850 0.083190 0.093187 0.152581 0.121851 0.145603 0.167098 0.159666
qa: -0.0753 -0.0818 -0.3651 -0.3844 0.1202 -0.3443 -0.4155 0.5865 0.2131 -0.0475 -0.1036 -0.1635 -0.1662 -0.2731 -0.0184 -0.1229 -0.1421 -0.1912 0.0648 0.1165 0.0555 0.0991 0.0977 0.1078 0.1439 0.1349 0.0854 0.0665 0.0799 0.0832 0.0932 0.1526 0.1219 0.1456 0.1671 0.1597
va: 1.2419 1.2220 2.0079 1.9814 3.3737 2.8853 3.0301 3.8567 3.8172 3.9531 3.7660 3.5472 3.9344 3.9362 3.9890 3.9304 4.0872 4.0566 4.0689 3.8608 4.0573 0.9956 0.9968 1.0011 1.0075 1.0328 1.0116 0.9990 1.0170 1.0019 1.0046 1.0190 1.0257 1.0071 1.0048 0.9956
dispcorr: -0.021008939 hartree
energy: -1777.747553783332
dipole: -21.09212 21.09385 0.00173 -8.63464 9.89421 1.25957 6.91517 -5.05351 1.86166
magnitude: 2.24773 au
magnitude: 5.71328 debye
