program: Orca
programVersion: 4.2.1
elementType: Cl Cl O O N N N C C C C C C C C C C C C C C H H H H H H H H H H H H H H H
charge: 0
multiplicity: 1
keywords: wb97x-d3
keywords: def2-TZVPP
keywords: def2/J RIJCOSX GRIDX6 NOFINALGRIDX
keywords: grid4 nofinalgrid
keywords: scfconv7
keywords: smallprint printgap noloewdin
keywords: NOSOSCF
formula: C14H15Cl2N3O2
InChI: InChI=1/C14H15Cl2N3O2/c1-2-11-6-20-14(21-11,7-19-9-17-8-18-19)12-4-3-10(15)5-13(12)16/h3-5,8-9,11H,2,6-7H2,1H3
36 atoms
Cl 0.155164 1.128304 -2.214972
Cl 3.192374 4.295619 0.806975
O  -1.357968 -0.501041 -0.304601
O  -0.423167 -1.234344 1.588436
N  -0.111993 -3.014808 -0.588156
N  0.012442 -4.031645 0.267577
N  -1.595586 -4.46032 -1.23088
C  -0.131642 -0.736291 0.320821
C  -2.409438 -0.53291 0.65914
C  -1.656493 -0.65859 1.977444
C  0.653308 -1.805865 -0.445731
C  0.694735 0.547574 0.406989
C  -3.285616 0.697255 0.556556
C  -3.975507 0.836569 -0.791159
C  0.864683 1.42605 -0.662043
C  1.347683 0.860184 1.595605
C  1.630457 2.576943 -0.548639
C  2.11419 2.004311 1.738941
C  -1.079822 -3.279275 -1.4702
C  2.244814 2.858311 0.658872
C  -0.891283 -4.875015 -0.158318
H  -3.013448 -1.430239 0.477151
H  -1.507086 0.318141 2.454954
H  -2.143628 -1.320772 2.691716
H  1.575968 -2.043309 0.081423
H  0.923185 -1.440091 -1.435064
H  -4.036205 0.632545 1.350027
H  -2.687245 1.588468 0.766828
H  -4.591487 -0.035963 -1.017956
H  -4.628866 1.709586 -0.803946
H  -3.253213 0.955232 -1.599187
H  1.256704 0.195559 2.443498
H  1.743659 3.241311 -1.394058
H  2.598835 2.217959 2.681363
H  -1.359041 -2.599498 -2.259279
H  -1.045852 -5.830913 0.317935
elementType: Cl O N C H
totalener: -1777.72749723 hartree
nucrepener: 2031.01649687 hartree
electener: -3808.74399410 hartree
oneelecener: -6475.37924272 hartree
twoeener: 2666.63524862 hartree
cpcmener: -0.02301085 hartree
kineticenergy: 1772.80455247 hartree
xcener: -124.637335406283 hartree
chargesum: 0.0000000
charge: -0.076587 -0.082569 -0.368087 -0.369079 0.132754 -0.352236 -0.413913 0.583879 0.162940 -0.026260 -0.122695 -0.097557 -0.130737 -0.262863 -0.049583 -0.139452 -0.142568 -0.182448 0.059362 0.111719 0.058521 0.084925 0.090641 0.116747 0.130014 0.151182 0.078075 0.058232 0.079320 0.092657 0.079989 0.152435 0.122262 0.145938 0.164258 0.160782
qa: -0.0766 -0.0826 -0.3681 -0.3691 0.1328 -0.3522 -0.4139 0.5839 0.1629 -0.0263 -0.1227 -0.0976 -0.1307 -0.2629 -0.0496 -0.1395 -0.1426 -0.1824 0.0594 0.1117 0.0585 0.0849 0.0906 0.1167 0.1300 0.1512 0.0781 0.0582 0.0793 0.0927 0.0800 0.1524 0.1223 0.1459 0.1643 0.1608
va: 1.2394 1.2214 2.0001 2.0093 3.3558 2.8912 3.0283 3.8721 3.8466 3.9537 3.7842 3.5592 3.9470 3.9295 4.0281 3.9243 4.0765 4.0452 4.0673 3.8671 4.0516 1.0007 0.9999 1.0003 1.0264 1.0112 1.0114 1.0103 1.0030 1.0042 1.0126 1.0213 1.0253 1.0068 1.0060 0.9950
dispcorr: -0.020469390 hartree
energy: -1777.747966615613
dipole: -23.43255 23.20993 -0.22262 -10.92167 12.32602 1.40435 6.36913 -5.55636 0.81276
magnitude: 1.63778 au
magnitude: 4.16292 debye
