program: Orca
programVersion: 4.2.1
elementType: Cl Cl O O N N N C C C C C C C C C C C C C C H H H H H H H H H H H H H H H
charge: 0
multiplicity: 1
keywords: wb97x-d3
keywords: def2-TZVPP
keywords: def2/J RIJCOSX GRIDX6 NOFINALGRIDX
keywords: grid4 nofinalgrid
keywords: scfconv7
keywords: smallprint printgap noloewdin
keywords: NOSOSCF
formula: C14H15Cl2N3O2
InChI: InChI=1/C14H15Cl2N3O2/c1-2-11-6-20-14(21-11,7-19-9-17-8-18-19)12-4-3-10(15)5-13(12)16/h3-5,8-9,11H,2,6-7H2,1H3
36 atoms
Cl -0.232281 1.050567 -2.533445
Cl 3.832587 2.53301 0.572337
O  -2.334133 0.087452 -0.696092
O  -1.750805 -0.96112 1.203377
N  0.134265 -2.583056 -0.452924
N  0.107297 -3.335263 0.648532
N  2.180798 -3.254813 -0.194187
C  -1.297136 -0.606052 -0.071449
C  -3.257848 0.524535 0.295537
C  -3.108442 -0.571285 1.338743
C  -1.025151 -1.866417 -0.913679
C  -0.02773 0.230651 0.072632
C  -2.946287 1.927232 0.796904
C  -4.078025 2.49322 1.641296
C  0.514418 0.97775 -0.971107
C  0.677912 0.212374 1.272851
C  1.695185 1.691731 -0.825504
C  1.860465 0.910497 1.444408
C  1.37755 -2.537602 -0.939924
C  2.358582 1.650708 0.387294
C  1.352654 -3.719362 0.762166
H  -4.249741 0.509785 -0.163179
H  -3.275504 -0.2350 2.362948
H  -3.777395 -1.414624 1.139668
H  -0.858714 -1.595469 -1.955001
H  -1.892252 -2.526439 -0.87712
H  -2.016468 1.928384 1.373516
H  -2.778323 2.573297 -0.068343
H  -5.008555 2.550809 1.073329
H  -4.271744 1.889487 2.52984
H  -3.840002 3.500376 1.983643
H  0.300212 -0.364617 2.104392
H  2.088644 2.268282 -1.651272
H  2.381012 0.87101 2.391054
H  1.640808 -1.988119 -1.830568
H  1.677704 -4.364349 1.563911
elementType: Cl O N C H
totalener: -1777.72424535 hartree
nucrepener: 2063.21885472 hartree
electener: -3840.94310007 hartree
oneelecener: -6540.28341517 hartree
twoeener: 2699.34031510 hartree
cpcmener: -0.02456844 hartree
kineticenergy: 1772.80516348 hartree
xcener: -124.638884872024 hartree
chargesum: 0.0000000
charge: -0.072129 -0.082219 -0.372534 -0.380415 0.129047 -0.347632 -0.399439 0.565633 0.173308 0.010988 -0.148565 -0.135259 -0.148806 -0.268240 0.006964 -0.144862 -0.132139 -0.169117 0.061990 0.112632 0.059466 0.100129 0.095365 0.088761 0.138453 0.120844 0.074705 0.068653 0.084886 0.078138 0.094741 0.143743 0.120011 0.146524 0.165761 0.160614
qa: -0.0721 -0.0822 -0.3725 -0.3804 0.1290 -0.3476 -0.3994 0.5656 0.1733 0.0110 -0.1486 -0.1353 -0.1488 -0.2682 0.0070 -0.1449 -0.1321 -0.1691 0.0620 0.1126 0.0595 0.1001 0.0954 0.0888 0.1385 0.1208 0.0747 0.0687 0.0849 0.0781 0.0947 0.1437 0.1200 0.1465 0.1658 0.1606
va: 1.2466 1.2219 2.0229 1.9819 3.3364 2.8877 3.0335 3.8600 3.9256 3.9792 3.9259 3.5041 3.9180 3.9537 3.9423 3.8857 4.0865 4.0608 4.0666 3.8627 4.0518 0.9963 0.9940 0.9985 1.0114 1.0186 1.0021 1.0191 1.0015 1.0052 1.0023 1.0329 1.0260 1.0044 0.9967 0.9960
dispcorr: -0.021514829 hartree
energy: -1777.745760180838
dipole: -27.32638 25.36459 -1.96179 -1.63417 2.53834 0.90417 11.99296 -11.88006 0.11290
magnitude: 2.16307 au
magnitude: 5.49810 debye
