program: Orca
programVersion: 4.2.1
elementType: Cl Cl O O N N N C C C C C C C C C C C C C C H H H H H H H H H H H H H H H
charge: 0
multiplicity: 1
keywords: wb97x-d3
keywords: def2-TZVPP
keywords: def2/J RIJCOSX GRIDX6 NOFINALGRIDX
keywords: grid4 nofinalgrid
keywords: scfconv7
keywords: smallprint printgap noloewdin
keywords: NOSOSCF
formula: C14H15Cl2N3O2
InChI: InChI=1/C14H15Cl2N3O2/c1-2-11-6-20-14(21-11,7-19-9-17-8-18-19)12-4-3-10(15)5-13(12)16/h3-5,8-9,11H,2,6-7H2,1H3
36 atoms
Cl 0.000126 1.114364 -2.256416
Cl 2.873818 4.41814 0.775999
O  -1.392911 -0.643411 -0.313981
O  -0.350475 -1.346099 1.517604
N  0.01551 -3.096666 -0.621769
N  0.282521 -4.057418 0.264076
N  -1.369298 -4.693173 -1.105901
C  -0.131172 -0.808352 0.252693
C  -2.338274 -0.41245 0.727811
C  -1.574922 -0.820583 1.996466
C  0.67419 -1.82014 -0.566515
C  0.628972 0.516879 0.342046
C  -2.82858 1.023294 0.762138
C  -3.556617 1.450725 -0.501083
C  0.718172 1.426414 -0.710577
C  1.290514 0.845858 1.521592
C  1.403779 2.625529 -0.586096
C  1.982767 2.035046 1.674429
C  -0.976841 -3.484796 -1.426189
C  2.025808 2.921735 0.613833
C  -0.565368 -4.995056 -0.067509
H  -3.183918 -1.081497 0.543706
H  -1.404787 0.036646 2.657467
H  -2.08447 -1.596103 2.567578
H  1.656573 -1.962228 -0.119062
H  0.825142 -1.453117 -1.580123
H  -3.499962 1.114324 1.621724
H  -1.988238 1.695713 0.959408
H  -4.418215 0.811094 -0.702099
H  -3.923358 2.473581 -0.409172
H  -2.903693 1.415121 -1.372875
H  1.266709 0.157106 2.354578
H  1.450797 3.314963 -1.417538
H  2.477239 2.259128 2.609256
H  -1.364729 -2.871051 -2.223185
H  -0.606048 -5.936525 0.457875
elementType: Cl O N C H
totalener: -1777.72681715 hartree
nucrepener: 2040.62335979 hartree
electener: -3818.35017693 hartree
oneelecener: -6494.59589869 hartree
twoeener: 2676.24572176 hartree
cpcmener: -0.02400584 hartree
kineticenergy: 1772.82141937 hartree
xcener: -124.641753819641 hartree
chargesum: -0.0000000
charge: -0.078032 -0.081341 -0.377120 -0.370746 0.127630 -0.350865 -0.415896 0.593041 0.213043 -0.044119 -0.113680 -0.161999 -0.167478 -0.274027 -0.012692 -0.130789 -0.139800 -0.186847 0.064352 0.113141 0.056898 0.096921 0.094494 0.108268 0.130332 0.149194 0.086094 0.066930 0.083220 0.093624 0.080379 0.152922 0.121912 0.146379 0.165806 0.160852
qa: -0.0780 -0.0813 -0.3771 -0.3707 0.1276 -0.3509 -0.4159 0.5930 0.2130 -0.0441 -0.1137 -0.1620 -0.1675 -0.2740 -0.0127 -0.1308 -0.1398 -0.1868 0.0644 0.1131 0.0569 0.0969 0.0945 0.1083 0.1303 0.1492 0.0861 0.0669 0.0832 0.0936 0.0804 0.1529 0.1219 0.1464 0.1658 0.1609
va: 1.2382 1.2227 1.9909 2.0024 3.3624 2.8924 3.0309 3.8546 3.7992 3.9611 3.7755 3.5403 3.9446 3.9341 3.9838 3.9371 4.0841 4.0521 4.0690 3.8658 4.0555 0.9981 0.9957 1.0004 1.0239 1.0145 1.0114 0.9993 1.0019 1.0048 1.0164 1.0200 1.0253 1.0066 1.0041 0.9951
dispcorr: -0.020981470 hartree
energy: -1777.747798616903
dipole: -20.57040 20.32920 -0.24120 -9.14008 10.71578 1.57570 7.55198 -6.78358 0.76840
magnitude: 1.76959 au
magnitude: 4.49795 debye
