program: Orca
programVersion: 4.2.1
elementType: Cl Cl O O N N N C C C C C C C C C C C C C C H H H H H H H H H H H H H H H
charge: 0
multiplicity: 1
keywords: wb97x-d3
keywords: def2-TZVPP
keywords: def2/J RIJCOSX GRIDX6 NOFINALGRIDX
keywords: grid4 nofinalgrid
keywords: scfconv7
keywords: smallprint printgap noloewdin
keywords: NOSOSCF
formula: C14H15Cl2N3O2
InChI: InChI=1/C14H15Cl2N3O2/c1-2-11-6-20-14(21-11,7-19-9-17-8-18-19)12-4-3-10(15)5-13(12)16/h3-5,8-9,11H,2,6-7H2,1H3
36 atoms
Cl -0.301522 1.008687 -2.548542
Cl 3.88473 2.575001 0.351584
O  -2.344236 0.231397 -0.548464
O  -1.678804 -0.837879 1.311762
N  0.04225 -2.541063 -0.384769
N  1.227579 -2.380496 -0.97801
N  1.416949 -3.737715 0.791548
C  -1.297049 -0.509342 0.010065
C  -3.470921 0.235595 0.328434
C  -3.093029 -0.822429 1.358772
C  -1.112667 -1.799427 -0.818356
C  -0.007907 0.293623 0.074816
C  -3.734888 1.626708 0.881689
C  -2.602777 2.24455 1.687418
C  0.505793 0.988092 -1.01728
C  0.733943 0.318899 1.251799
C  1.696579 1.694431 -0.941046
C  1.929448 1.00896 1.353917
C  0.171424 -3.34517 0.674745
C  2.398935 1.697632 0.250608
C  2.019254 -3.117202 -0.242703
H  -4.346637 -0.085211 -0.242318
H  -3.405583 -0.581541 2.375064
H  -3.50931 -1.802556 1.100481
H  -0.988835 -1.574437 -1.874701
H  -1.999541 -2.427925 -0.720279
H  -3.986592 2.284613 0.045357
H  -4.63929 1.564013 1.493978
H  -1.700473 2.368557 1.08827
H  -2.89294 3.235388 2.039135
H  -2.342113 1.656416 2.568447
H  0.377194 -0.211393 2.122358
H  2.068439 2.231108 -1.802812
H  2.47917 1.006209 2.284814
H  -0.654429 -3.6231 1.310387
H  3.071078 -3.215601 -0.462627
elementType: Cl O N C H
totalener: -1777.72399062 hartree
nucrepener: 2078.37261945 hartree
electener: -3856.09661007 hartree
oneelecener: -6570.91384605 hartree
twoeener: 2714.81723598 hartree
cpcmener: -0.02479695 hartree
kineticenergy: 1772.80223132 hartree
xcener: -124.639260966100 hartree
chargesum: 0.0000000
charge: -0.072581 -0.084969 -0.380429 -0.380591 0.123818 -0.335620 -0.405308 0.552547 0.165234 -0.008499 -0.163901 -0.121398 -0.134467 -0.270703 0.043490 -0.127318 -0.151830 -0.183207 0.060587 0.122673 0.058517 0.093950 0.100620 0.093386 0.133205 0.130556 0.069297 0.069447 0.082238 0.102629 0.080533 0.145454 0.119101 0.145407 0.168134 0.159999
qa: -0.0726 -0.0850 -0.3804 -0.3806 0.1238 -0.3356 -0.4053 0.5525 0.1652 -0.0085 -0.1639 -0.1214 -0.1345 -0.2707 0.0435 -0.1273 -0.1518 -0.1832 0.0606 0.1227 0.0585 0.0940 0.1006 0.0934 0.1332 0.1306 0.0693 0.0694 0.0822 0.1026 0.0805 0.1455 0.1191 0.1454 0.1681 0.1600
va: 1.2482 1.2190 2.0231 1.9625 3.3412 2.8830 3.0375 3.8739 3.9035 3.9584 3.9519 3.4656 3.9224 3.9448 3.9394 3.8603 4.1107 4.0685 4.0736 3.8484 4.0448 0.9976 0.9962 0.9990 1.0288 1.0014 1.0108 1.0115 1.0006 1.0048 1.0055 1.0271 1.0263 1.0052 1.0025 0.9965
dispcorr: -0.022271255 hartree
energy: -1777.746261872707
dipole: -26.18649 23.46942 -2.71707 -4.20027 4.23840 0.03814 13.72073 -12.87344 0.84729
magnitude: 2.84637 au
magnitude: 7.23490 debye
