program: Orca
programVersion: 4.2.1
elementType: Cl Cl O O N N N C C C C C C C C C C C C C C H H H H H H H H H H H H H H H
charge: 0
multiplicity: 1
keywords: wb97x-d3
keywords: def2-TZVPP
keywords: def2/J RIJCOSX GRIDX6 NOFINALGRIDX
keywords: grid4 nofinalgrid
keywords: scfconv7
keywords: smallprint printgap noloewdin
keywords: NOSOSCF
formula: C14H15Cl2N3O2
InChI: InChI=1/C14H15Cl2N3O2/c1-2-11-6-20-14(21-11,7-19-9-17-8-18-19)12-4-3-10(15)5-13(12)16/h3-5,8-9,11H,2,6-7H2,1H3
36 atoms
Cl -0.487625 1.025613 -2.452843
Cl 3.680868 2.741604 0.383941
O  -2.422998 0.015189 -0.418314
O  -1.622158 -1.094592 1.366443
N  0.106863 -2.609835 -0.439012
N  1.278984 -2.37945 -1.035753
N  1.530007 -3.836971 0.644103
C  -1.307056 -0.663558 0.068926
C  -3.231191 0.409282 0.68761
C  -2.957474 -0.717203 1.670354
C  -1.080202 -1.894044 -0.826192
C  -0.062366 0.218194 0.128222
C  -2.879839 1.79177 1.216017
C  -2.964139 2.878951 0.157443
C  0.369174 0.990872 -0.947533
C  0.719968 0.239318 1.278677
C  1.51197 1.772666 -0.876772
C  1.870945 1.002353 1.374762
C  0.2725 -3.475319 0.566133
C  2.254424 1.770161 0.290477
C  2.10114 -3.136645 -0.356902
H  -4.267383 0.400934 0.341445
H  -3.009422 -0.405797 2.714498
H  -3.640322 -1.559715 1.52414
H  -0.97309 -1.610122 -1.870291
H  -1.942833 -2.556621 -0.747033
H  -3.580221 2.012514 2.026533
H  -1.884331 1.786667 1.669738
H  -2.74829 3.857025 0.588511
H  -2.251895 2.713735 -0.651073
H  -3.961408 2.929221 -0.2850
H  0.426242 -0.352934 2.133027
H  1.817292 2.37055 -1.724256
H  2.453706 0.994343 2.28535
H  -0.536062 -3.815493 1.193356
H  3.152375 -3.191508 -0.594024
elementType: Cl O N C H
totalener: -1777.72527612 hartree
nucrepener: 2081.59360818 hartree
electener: -3859.31888430 hartree
oneelecener: -6577.30883124 hartree
twoeener: 2717.98994694 hartree
cpcmener: -0.02377899 hartree
kineticenergy: 1772.80004837 hartree
xcener: -124.638835893403 hartree
chargesum: -0.0000000
charge: -0.079080 -0.084719 -0.368464 -0.394258 0.114374 -0.337772 -0.406928 0.537678 0.182133 0.003665 -0.115608 -0.064846 -0.164273 -0.274512 -0.026551 -0.166479 -0.124575 -0.166507 0.063102 0.106440 0.060185 0.106523 0.093934 0.092225 0.130767 0.126008 0.082050 0.077916 0.095015 0.077325 0.084556 0.147082 0.118842 0.145679 0.168880 0.160191
qa: -0.0791 -0.0847 -0.3685 -0.3943 0.1144 -0.3378 -0.4069 0.5377 0.1821 0.0037 -0.1156 -0.0648 -0.1643 -0.2745 -0.0266 -0.1665 -0.1246 -0.1665 0.0631 0.1064 0.0602 0.1065 0.0939 0.0922 0.1308 0.1260 0.0821 0.0779 0.0950 0.0773 0.0846 0.1471 0.1188 0.1457 0.1689 0.1602
va: 1.2386 1.2194 2.0174 1.9679 3.3508 2.8787 3.0377 3.9064 3.8938 4.0009 3.8803 3.4850 3.9118 3.9454 3.9451 3.8886 4.0837 4.0510 4.0703 3.8630 4.0421 0.9924 0.9920 0.9974 1.0275 1.0129 1.0109 0.9996 1.0057 1.0154 1.0021 1.0277 1.0255 1.0045 1.0044 0.9962
dispcorr: -0.022285871 hartree
energy: -1777.747561995273
dipole: -24.10505 21.63620 -2.46885 -2.13543 2.50242 0.36699 11.13512 -10.06755 1.06757
magnitude: 2.71471 au
magnitude: 6.90023 debye
