program: Orca
programVersion: 4.2.1
elementType: Cl Cl O O N N N C C C C C C C C C C C C C C H H H H H H H H H H H H H H H
charge: 0
multiplicity: 1
keywords: wb97x-d3
keywords: def2-TZVPP
keywords: def2/J RIJCOSX GRIDX6 NOFINALGRIDX
keywords: grid4 nofinalgrid
keywords: scfconv7
keywords: smallprint printgap noloewdin
keywords: NOSOSCF
formula: C14H15Cl2N3O2
InChI: InChI=1/C14H15Cl2N3O2/c1-2-11-6-20-14(21-11,7-19-9-17-8-18-19)12-4-3-10(15)5-13(12)16/h3-5,8-9,11H,2,6-7H2,1H3
36 atoms
Cl 0.044127 0.32369 -1.90332
Cl 3.739335 2.921228 0.889116
O  -2.04614 -0.469689 -0.045944
O  -1.738142 -0.575712 2.154893
N  -0.006609 -2.559562 -0.362688
N  1.316635 -2.450317 -0.503977
N  0.382592 -3.182137 -2.40225
C  -1.087112 -0.734147 0.928342
C  -3.042166 0.396849 0.50296
C  -2.644444 0.497478 1.978249
C  -0.668655 -2.207573 0.863336
C  0.117265 0.208458 0.842078
C  -3.094957 1.735917 -0.204916
C  -3.541059 1.637906 -1.654516
C  0.666377 0.708935 -0.337199
C  0.749609 0.562298 2.032778
C  1.774761 1.545456 -0.326501
C  1.857837 1.388965 2.071477
C  -0.550708 -2.992133 -1.503482
C  2.36006 1.880185 0.879834
C  1.50377 -2.83113 -1.741218
H  -4.007567 -0.109242 0.39644
H  -2.169064 1.459224 2.206415
H  -3.484122 0.361393 2.658499
H  -1.560554 -2.826539 0.965664
H  0.000638 -2.440608 1.690771
H  -3.793363 2.370811 0.349184
H  -2.118026 2.224121 -0.137126
H  -4.532524 1.187964 -1.73523
H  -3.59221 2.62562 -2.11395
H  -2.853268 1.036412 -2.248003
H  0.363744 0.184466 2.969597
H  2.175138 1.924669 -1.256359
H  2.315708 1.642232 3.017463
H  -1.609556 -3.158528 -1.624492
H  2.488057 -2.864676 -2.182275
elementType: Cl O N C H
totalener: -1777.72387216 hartree
nucrepener: 2093.23765083 hartree
electener: -3870.96152299 hartree
oneelecener: -6600.73930452 hartree
twoeener: 2729.77778152 hartree
cpcmener: -0.02442680 hartree
kineticenergy: 1772.80639197 hartree
xcener: -124.640497336027 hartree
chargesum: -0.0000000
charge: -0.075458 -0.084167 -0.370717 -0.377938 0.094758 -0.344285 -0.398732 0.600812 0.170437 -0.028288 -0.062754 -0.060339 -0.159910 -0.271850 -0.081046 -0.195811 -0.099001 -0.165606 0.064166 0.088146 0.058108 0.090733 0.091697 0.114708 0.123923 0.128685 0.085260 0.067755 0.082495 0.093726 0.081040 0.146775 0.119871 0.145990 0.167493 0.159323
qa: -0.0755 -0.0842 -0.3707 -0.3779 0.0948 -0.3443 -0.3987 0.6008 0.1704 -0.0283 -0.0628 -0.0603 -0.1599 -0.2719 -0.0810 -0.1958 -0.0990 -0.1656 0.0642 0.0881 0.0581 0.0907 0.0917 0.1147 0.1239 0.1287 0.0853 0.0678 0.0825 0.0937 0.0810 0.1468 0.1199 0.1460 0.1675 0.1593
va: 1.2376 1.2199 2.0065 1.9922 3.3643 2.8649 3.0273 3.8184 3.8534 3.9632 3.8453 3.5073 3.9237 3.9337 3.9642 3.9956 4.0373 4.0163 4.0760 3.8853 4.0536 0.9996 0.9993 0.9971 1.0173 1.0129 1.0134 1.0038 1.0018 1.0042 1.0137 1.0239 1.0249 1.0055 1.0008 0.9968
dispcorr: -0.022074622 hartree
energy: -1777.745946780783
dipole: -26.37927 24.38562 -1.99365 -1.32906 2.04084 0.71178 3.90442 -2.07968 1.82474
magnitude: 2.79481 au
magnitude: 7.10384 debye
