program: Orca
programVersion: 4.2.1
elementType: Cl Cl O O N N N C C C C C C C C C C C C C C H H H H H H H H H H H H H H H
charge: 0
multiplicity: 1
keywords: wb97x-d3
keywords: def2-TZVPP
keywords: def2/J RIJCOSX GRIDX6 NOFINALGRIDX
keywords: grid4 nofinalgrid
keywords: scfconv7
keywords: smallprint printgap noloewdin
keywords: NOSOSCF
formula: C14H15Cl2N3O2
InChI: InChI=1/C14H15Cl2N3O2/c1-2-11-6-20-14(21-11,7-19-9-17-8-18-19)12-4-3-10(15)5-13(12)16/h3-5,8-9,11H,2,6-7H2,1H3
36 atoms
Cl 2.015217 -0.136854 1.987864
Cl 2.71709 4.608456 -0.324195
O  -1.528949 -0.461334 -0.782619
O  -0.65411 -1.027637 1.201081
N  -0.187711 -2.955748 -0.825727
N  -0.055337 -3.877462 0.129754
N  -1.575795 -4.527167 -1.380142
C  -0.322468 -0.616876 -0.08571
C  -2.630775 -0.681934 0.10132
C  -1.968155 -0.573215 1.463195
C  0.515768 -1.702991 -0.771469
C  0.455801 0.69816 -0.104717
C  -3.770553 0.275212 -0.19057
C  -3.477933 1.755399 0.003427
C  1.496173 0.986704 0.776881
C  0.170485 1.648832 -1.081442
C  2.188824 2.188299 0.721641
C  0.853191 2.849443 -1.167952
C  -1.099272 -3.353879 -1.717732
C  1.855025 3.113011 -0.250945
C  -0.901389 -4.800821 -0.245158
H  -2.997036 -1.705237 -0.046271
H  -1.961237 0.450651 1.853084
H  -2.423133 -1.220424 2.213042
H  1.456017 -1.862884 -0.246964
H  0.753191 -1.385826 -1.78686
H  -4.105894 0.097265 -1.215512
H  -4.607745 -0.022563 0.446842
H  -4.327941 2.350593 -0.331998
H  -3.302863 2.013734 1.04814
H  -2.609958 2.082971 -0.568805
H  -0.609083 1.451616 -1.803182
H  2.981639 2.392035 1.427868
H  0.600856 3.563573 -1.939455
H  -1.370985 -2.771169 -2.583603
H  -1.037207 -5.710696 0.319004
elementType: Cl O N C H
totalener: -1777.72522372 hartree
nucrepener: 2029.08237637 hartree
electener: -3806.80760009 hartree
oneelecener: -6471.71400520 hartree
twoeener: 2664.90640511 hartree
cpcmener: -0.02490459 hartree
kineticenergy: 1772.80690855 hartree
xcener: -124.639903485935 hartree
chargesum: -0.0000000
charge: -0.070986 -0.082524 -0.407614 -0.353820 0.129733 -0.347903 -0.410601 0.564148 0.108451 0.015487 -0.109276 -0.043709 -0.106433 -0.287182 -0.014167 -0.219900 -0.149682 -0.162513 0.045501 0.108670 0.057905 0.083714 0.088443 0.115227 0.130913 0.140612 0.075715 0.071501 0.101605 0.079779 0.091915 0.157540 0.121489 0.145851 0.171842 0.160268
qa: -0.0710 -0.0825 -0.4076 -0.3538 0.1297 -0.3479 -0.4106 0.5641 0.1085 0.0155 -0.1093 -0.0437 -0.1064 -0.2872 -0.0142 -0.2199 -0.1497 -0.1625 0.0455 0.1087 0.0579 0.0837 0.0884 0.1152 0.1309 0.1406 0.0757 0.0715 0.1016 0.0798 0.0919 0.1575 0.1215 0.1459 0.1718 0.1603
va: 1.2477 1.2221 1.9808 2.0027 3.3750 2.8904 3.0231 3.8969 3.9693 3.9319 3.8100 3.5286 3.9060 3.9480 4.0008 3.9779 4.0793 4.0370 4.0604 3.8727 4.0485 1.0003 1.0033 0.9966 1.0305 1.0031 1.0075 1.0102 1.0050 1.0026 1.0001 1.0183 1.0261 1.0066 1.0019 0.9955
dispcorr: -0.020821003 hartree
energy: -1777.746044718525
dipole: -28.63551 27.72303 -0.91249 -6.23245 7.79331 1.56086 -5.34954 4.75359 -0.59595
magnitude: 1.90370 au
magnitude: 4.83882 debye
