program: Orca
programVersion: 4.2.1
elementType: Cl Cl O O N N N C C C C C C C C C C C C C C H H H H H H H H H H H H H H H
charge: 0
multiplicity: 1
keywords: wb97x-d3
keywords: def2-TZVPP
keywords: def2/J RIJCOSX GRIDX6 NOFINALGRIDX
keywords: grid4 nofinalgrid
keywords: scfconv7
keywords: smallprint printgap noloewdin
keywords: NOSOSCF
formula: C14H15Cl2N3O2
InChI: InChI=1/C14H15Cl2N3O2/c1-2-11-6-20-14(21-11,7-19-9-17-8-18-19)12-4-3-10(15)5-13(12)16/h3-5,8-9,11H,2,6-7H2,1H3
36 atoms
Cl -0.454952 1.053538 -2.331879
Cl 3.681876 2.58997 0.652243
O  -2.430672 -0.033609 -0.361701
O  -1.698083 -1.255708 1.343847
N  0.128353 -2.623607 -0.551634
N  1.251915 -2.326772 -1.207827
N  1.665513 -3.798126 0.427454
C  -1.329616 -0.75368 0.09414
C  -3.119511 0.503323 0.766992
C  -2.53773 -0.287126 1.949304
C  -1.10603 -1.943586 -0.846058
C  -0.078144 0.117583 0.210799
C  -2.93653 2.002922 0.906343
C  -3.460014 2.796891 -0.278186
C  0.374712 0.943139 -0.815924
C  0.691494 0.06657 1.368381
C  1.524892 1.706166 -0.689527
C  1.844804 0.816874 1.524436
C  0.389524 -3.49829 0.423608
C  2.249116 1.637671 0.487996
C  2.144675 -3.054319 -0.589761
H  -4.180778 0.278121 0.626347
H  -1.971478 0.360151 2.628791
H  -3.299931 -0.805909 2.530373
H  -1.067171 -1.617536 -1.882202
H  -1.938438 -2.64032 -0.74393
H  -3.465051 2.306863 1.815696
H  -1.880418 2.232822 1.077852
H  -3.347549 3.868383 -0.104346
H  -2.919323 2.555518 -1.194224
H  -4.520603 2.603038 -0.454028
H  0.390516 -0.579393 2.181207
H  1.851273 2.340395 -1.502095
H  2.414178 0.753578 2.441393
H  -0.367396 -3.886055 1.086825
H  3.182313 -3.053378 -0.885355
elementType: Cl O N C H
totalener: -1777.72541286 hartree
nucrepener: 2083.88990441 hartree
electener: -3861.61531727 hartree
oneelecener: -6581.76459956 hartree
twoeener: 2720.14928229 hartree
cpcmener: -0.02333425 hartree
kineticenergy: 1772.80912205 hartree
xcener: -124.639719710476 hartree
chargesum: 0.0000000
charge: -0.077583 -0.083581 -0.370695 -0.381664 0.112785 -0.332518 -0.405044 0.591411 0.203653 -0.053083 -0.092712 -0.201297 -0.168601 -0.271256 0.017898 -0.117080 -0.135901 -0.197735 0.058260 0.118774 0.060533 0.099235 0.094749 0.109950 0.134551 0.128591 0.085765 0.068410 0.093242 0.078382 0.082608 0.154501 0.119904 0.145858 0.169970 0.159719
qa: -0.0776 -0.0836 -0.3707 -0.3817 0.1128 -0.3325 -0.4050 0.5914 0.2037 -0.0531 -0.0927 -0.2013 -0.1686 -0.2713 0.0179 -0.1171 -0.1359 -0.1977 0.0583 0.1188 0.0605 0.0992 0.0947 0.1099 0.1346 0.1286 0.0858 0.0684 0.0932 0.0784 0.0826 0.1545 0.1199 0.1459 0.1700 0.1597
va: 1.2397 1.2206 2.0188 1.9805 3.3588 2.8791 3.0327 3.8383 3.8283 3.9732 3.8138 3.5499 3.9275 3.9383 3.9395 3.8539 4.0979 4.0880 4.0678 3.8565 4.0425 0.9965 0.9943 0.9998 1.0266 1.0238 1.0122 0.9999 1.0047 1.0166 1.0015 1.0156 1.0254 1.0059 1.0041 0.9964
dispcorr: -0.022242488 hartree
energy: -1777.747655345645
dipole: -24.38065 22.27767 -2.10298 -0.65205 1.24406 0.59201 9.43389 -8.19817 1.23571
magnitude: 2.50998 au
magnitude: 6.37985 debye
