program: Orca
programVersion: 4.2.1
elementType: Cl Cl O O N N N C C C C C C C C C C C C C C H H H H H H H H H H H H H H H
charge: 0
multiplicity: 1
keywords: wb97x-d3
keywords: def2-TZVPP
keywords: def2/J RIJCOSX GRIDX6 NOFINALGRIDX
keywords: grid4 nofinalgrid
keywords: scfconv7
keywords: smallprint printgap noloewdin
keywords: NOSOSCF
formula: C14H15Cl2N3O2
InChI: InChI=1/C14H15Cl2N3O2/c1-2-11-6-20-14(21-11,7-19-9-17-8-18-19)12-4-3-10(15)5-13(12)16/h3-5,8-9,11H,2,6-7H2,1H3
36 atoms
Cl 1.97728 -0.276882 2.013337
Cl 2.895488 4.560147 -0.010346
O  -1.487342 -0.323906 -0.867773
O  -0.733674 -0.974288 1.147387
N  -0.241659 -2.901335 -0.833515
N  -0.975778 -3.229916 -1.901246
N  -1.242943 -4.746261 -0.269447
C  -0.329842 -0.551154 -0.12126
C  -2.628859 -0.70145 -0.112585
C  -2.095102 -0.645094 1.310143
C  0.496564 -1.671609 -0.774405
C  0.496753 0.728985 -0.060707
C  -3.812199 0.196206 -0.428075
C  -3.578418 1.690523 -0.25784
C  1.528644 0.92773 0.855407
C  0.256504 1.747564 -0.978233
C  2.26479 2.103502 0.878069
C  0.982069 2.925504 -0.980168
C  -0.419767 -3.813829 0.134285
C  1.982067 3.0987 -0.039569
C  -1.55414 -4.34216 -1.520064
H  -2.902794 -1.734468 -0.363066
H  -2.208779 0.346381 1.76363
H  -2.556663 -1.382175 1.967251
H  1.417818 -1.835869 -0.215916
H  0.762834 -1.385146 -1.790441
H  -4.132618 -0.007343 -1.452036
H  -4.640643 -0.128278 0.20861
H  -3.287667 1.958128 0.757257
H  -2.803428 2.056062 -0.928031
H  -4.491296 2.239953 -0.484096
H  -0.523346 1.616869 -1.714228
H  3.052034 2.235259 1.606486
H  0.768895 3.69892 -1.704262
H  0.067466 -3.755994 1.094895
H  -2.219526 -4.888239 -2.170311
totalener: -1777.70068892 hartree
nucrepener: 2030.31811821 hartree
electener: -3808.01880713 hartree
oneelecener: -6473.89910995 hartree
twoeener: 2665.88030281 hartree
kineticenergy: 1772.81514355 hartree
xcener: -124.640652830223 hartree
chargesum: 0.0000000
charge: -0.059579 -0.064433 -0.363569 -0.352045 0.107291 -0.304559 -0.327526 0.557636 0.088191 0.024849 -0.141081 -0.064215 -0.119303 -0.260020 -0.011598 -0.163814 -0.154731 -0.152069 0.031969 0.104114 0.047440 0.082274 0.080113 0.100959 0.134887 0.122775 0.080218 0.063622 0.071466 0.083503 0.096606 0.147270 0.113326 0.124164 0.145731 0.130137
qa: -0.0596 -0.0644 -0.3636 -0.3520 0.1073 -0.3046 -0.3275 0.5576 0.0882 0.0248 -0.1411 -0.0642 -0.1193 -0.2600 -0.0116 -0.1638 -0.1547 -0.1521 0.0320 0.1041 0.0474 0.0823 0.0801 0.1010 0.1349 0.1228 0.0802 0.0636 0.0715 0.0835 0.0966 0.1473 0.1133 0.1242 0.1457 0.1301
va: 1.2607 1.2413 2.0206 2.0000 3.3607 2.8597 3.0554 3.8594 4.0099 3.9267 3.8310 3.5822 3.9147 3.9506 4.0188 3.9724 4.0861 4.0514 4.0789 3.9349 4.0474 0.9956 1.0073 0.9981 1.0165 1.0244 1.0070 1.0098 1.0094 1.0063 1.0066 1.0193 1.0279 1.0149 1.0101 1.0027
dispcorr: -0.020885937 hartree
energy: -1777.721574855068
dipole: -28.88440 28.44798 -0.43642 -6.66779 7.64922 0.98143 -6.08031 6.27214 0.19183
magnitude: 1.09108 au
magnitude: 2.77331 debye
