program: Orca
programVersion: 4.2.1
elementType: Cl Cl O O N N N C C C C C C C C C C C C C C H H H H H H H H H H H H H H H
charge: 0
multiplicity: 1
keywords: wb97x-d3
keywords: def2-TZVPP
keywords: def2/J RIJCOSX GRIDX6 NOFINALGRIDX
keywords: grid4 nofinalgrid
keywords: scfconv7
keywords: smallprint printgap noloewdin
keywords: NOSOSCF
formula: C14H15Cl2N3O2
InChI: InChI=1/C14H15Cl2N3O2/c1-2-11-6-20-14(21-11,7-19-9-17-8-18-19)12-4-3-10(15)5-13(12)16/h3-5,8-9,11H,2,6-7H2,1H3
36 atoms
Cl 1.876239 -0.233507 1.86903
Cl 2.880222 4.574041 -0.189696
O  -1.57254 -0.26484 -1.033199
O  -0.843672 -0.841978 1.008497
N  -0.203267 -2.884162 -0.807043
N  -1.161197 -3.299433 -1.641193
N  -0.859374 -4.788623 0.009949
C  -0.426534 -0.480176 -0.270041
C  -2.743725 -0.612878 -0.311897
C  -2.190677 -1.263664 0.957394
C  0.414707 -1.595045 -0.93181
C  0.416678 0.785804 -0.210607
C  -3.632607 0.598518 -0.069449
C  -3.014986 1.713762 0.762228
C  1.449177 0.974134 0.706167
C  0.194257 1.799087 -1.137922
C  2.205895 2.136635 0.71978
C  0.939921 2.964572 -1.147666
C  -0.041408 -3.781592 0.176779
C  1.941857 3.128242 -0.20753
C  -1.521959 -4.445127 -1.115272
H  -3.295162 -1.345921 -0.907047
H  -2.691907 -0.921259 1.864863
H  -2.269428 -2.354575 0.92326
H  1.39956 -1.648998 -0.469431
H  0.550409 -1.367835 -1.988516
H  -3.950226 0.994634 -1.037426
H  -4.544874 0.23636 0.414954
H  -2.706282 1.375728 1.751996
H  -2.141219 2.14646 0.2782
H  -3.735498 2.518065 0.908482
H  -0.591479 1.676756 -1.869568
H  2.993672 2.261574 1.448819
H  0.740121 3.736009 -1.877688
H  0.671014 -3.653565 0.977165
H  -2.284761 -5.061498 -1.564779
totalener: -1777.69910950 hartree
nucrepener: 2046.24705478 hartree
electener: -3823.94616428 hartree
oneelecener: -6505.74429118 hartree
twoeener: 2681.79812690 hartree
kineticenergy: 1772.80829060 hartree
xcener: -124.640673196657 hartree
chargesum: -0.0000000
charge: -0.060828 -0.064921 -0.368076 -0.341645 0.117181 -0.316392 -0.329458 0.576017 0.166367 -0.030018 -0.178764 -0.030473 -0.157595 -0.254806 -0.048596 -0.163894 -0.151492 -0.139011 0.045147 0.098073 0.056175 0.080150 0.086004 0.093749 0.134981 0.122203 0.071389 0.065705 0.080386 0.088898 0.095742 0.146009 0.113897 0.125739 0.139723 0.132432
qa: -0.0608 -0.0649 -0.3681 -0.3416 0.1172 -0.3164 -0.3295 0.5760 0.1664 -0.0300 -0.1788 -0.0305 -0.1576 -0.2548 -0.0486 -0.1639 -0.1515 -0.1390 0.0451 0.0981 0.0562 0.0802 0.0860 0.0937 0.1350 0.1222 0.0714 0.0657 0.0804 0.0889 0.0957 0.1460 0.1139 0.1257 0.1397 0.1324
va: 1.2601 1.2407 2.0230 2.0237 3.3421 2.8552 3.0543 3.7912 3.8983 3.9818 3.8832 3.5127 3.9316 3.9380 4.0500 3.9254 4.0786 4.0390 4.0605 3.9383 4.0258 1.0089 0.9995 0.9945 1.0124 1.0264 1.0112 1.0109 1.0091 1.0004 1.0055 1.0269 1.0263 1.0134 1.0106 1.0029
dispcorr: -0.021705125 hartree
energy: -1777.720814625769
dipole: -27.09775 26.71681 -0.38094 -7.36857 8.14245 0.77388 -3.30364 3.24033 -0.06331
magnitude: 0.86488 au
magnitude: 2.19835 debye
