program: Orca
programVersion: 4.2.1
elementType: Cl Cl O O N N N C C C C C C C C C C C C C C H H H H H H H H H H H H H H H
charge: 0
multiplicity: 1
keywords: wb97x-d3
keywords: def2-TZVPP
keywords: def2/J RIJCOSX GRIDX6 NOFINALGRIDX
keywords: grid4 nofinalgrid
keywords: scfconv7
keywords: smallprint printgap noloewdin
keywords: NOSOSCF
formula: C14H15Cl2N3O2
InChI: InChI=1/C14H15Cl2N3O2/c1-2-11-6-20-14(21-11,7-19-9-17-8-18-19)12-4-3-10(15)5-13(12)16/h3-5,8-9,11H,2,6-7H2,1H3
36 atoms
Cl 0.54519 -0.114389 2.882553
Cl 3.418793 2.898596 -0.435605
O  -2.262234 -0.527009 -0.625349
O  -2.090062 -0.407589 1.59379
N  -0.018711 -2.513608 -0.538981
N  -0.441598 -2.759557 -1.78193
N  1.79941 -2.823793 -1.689094
C  -1.37047 -0.692351 0.436827
C  -3.337858 0.306103 -0.210278
C  -2.984914 0.621725 1.245433
C  -0.92862 -2.160657 0.513628
C  -0.164843 0.233032 0.260374
C  -3.480221 1.531956 -1.091561
C  -3.780301 1.197945 -2.545195
C  0.723815 0.539428 1.289055
C  0.119308 0.752628 -0.999372
C  1.821295 1.362865 1.083726
C  1.212953 1.56677 -1.232339
C  1.322827 -2.54714 -0.50417
C  2.055382 1.876376 -0.179061
C  0.6799 -2.942767 -2.434452
H  -4.25875 -0.287449 -0.265388
H  -2.512307 1.608641 1.33732
H  -3.84129 0.584859 1.918033
H  -1.806964 -2.802817 0.457414
H  -0.432867 -2.338466 1.467324
H  -4.289301 2.144914 -0.68147
H  -2.572078 2.137522 -1.020019
H  -3.883289 2.105019 -3.140122
H  -2.987968 0.596295 -2.989551
H  -4.710229 0.635009 -2.639892
H  -0.530662 0.50196 -1.825476
H  2.487347 1.593325 1.902955
H  1.409019 1.950057 -2.22348
H  1.893209 -2.369603 0.395289
H  0.691709 -3.180134 -3.486778
totalener: -1777.69911736 hartree
nucrepener: 2068.99656714 hartree
electener: -3846.69568450 hartree
oneelecener: -6551.38760315 hartree
twoeener: 2704.69191865 hartree
kineticenergy: 1772.81529269 hartree
xcener: -124.637909673576 hartree
chargesum: 0.0000000
charge: -0.055559 -0.063789 -0.343401 -0.323179 0.112665 -0.301748 -0.322968 0.585693 0.128640 0.000317 -0.117652 -0.148741 -0.170449 -0.240696 -0.043524 -0.166675 -0.127005 -0.140528 0.037772 0.104971 0.055880 0.074216 0.075662 0.098733 0.107772 0.129549 0.076502 0.065177 0.087060 0.090249 0.074489 0.151463 0.113076 0.125012 0.140508 0.130509
qa: -0.0556 -0.0638 -0.3434 -0.3232 0.1127 -0.3017 -0.3230 0.5857 0.1286 0.0003 -0.1177 -0.1487 -0.1704 -0.2407 -0.0435 -0.1667 -0.1270 -0.1405 0.0378 0.1050 0.0559 0.0742 0.0757 0.0987 0.1078 0.1295 0.0765 0.0652 0.0871 0.0902 0.0745 0.1515 0.1131 0.1250 0.1405 0.1305
va: 1.2672 1.2414 2.0292 2.0478 3.3216 2.8679 3.0634 3.8452 3.9037 3.9661 3.8691 3.5560 3.9433 3.9362 4.0033 3.8977 4.0601 4.0760 4.0790 3.9348 4.0490 0.9982 1.0018 0.9943 1.0332 1.0134 1.0130 1.0059 1.0046 1.0115 1.0048 1.0114 1.0273 1.0124 1.0036 1.0019
dispcorr: -0.021755795 hartree
energy: -1777.720873157338
dipole: -27.99424 26.75039 -1.24385 -0.85084 1.66231 0.81147 -12.81729 13.32862 0.51133
magnitude: 1.57070 au
magnitude: 3.99240 debye
