program: Orca
programVersion: 4.2.1
elementType: Cl Cl O O N N N C C C C C C C C C C C C C C H H H H H H H H H H H H H H H
charge: 0
multiplicity: 1
keywords: wb97x-d3
keywords: def2-TZVPP
keywords: def2/J RIJCOSX GRIDX6 NOFINALGRIDX
keywords: grid4 nofinalgrid
keywords: scfconv7
keywords: smallprint printgap noloewdin
keywords: NOSOSCF
formula: C14H15Cl2N3O2
InChI: InChI=1/C14H15Cl2N3O2/c1-2-11-6-20-14(21-11,7-19-9-17-8-18-19)12-4-3-10(15)5-13(12)16/h3-5,8-9,11H,2,6-7H2,1H3
36 atoms
Cl 2.2744 -0.487467 1.737425
Cl 3.068546 4.510952 0.084254
O  -1.546978 -0.184276 -0.642613
O  -0.597252 -0.999363 1.223002
N  -0.440591 -2.759266 -0.981565
N  -1.26698 -2.946718 -2.015518
N  -1.516003 -4.587785 -0.506427
C  -0.321728 -0.493882 -0.049892
C  -2.608952 -0.496669 0.24803
C  -1.886545 -0.560119 1.584172
C  0.377045 -1.583877 -0.876454
C  0.547226 0.759156 0.015628
C  -3.701212 0.547471 0.162347
C  -4.372672 0.606906 -1.201646
C  1.711345 0.838772 0.778725
C  0.200371 1.880053 -0.73258
C  2.487404 1.988097 0.805782
C  0.960068 3.036522 -0.7249
C  -0.608652 -3.744898 -0.086159
C  2.10402 3.082736 0.05207
C  -1.887175 -4.05371 -1.690446
H  -3.019441 -1.481656 -0.013265
H  -1.853174 0.424531 2.070045
H  -2.319595 -1.278767 2.279624
H  1.332953 -1.848758 -0.425925
H  0.566932 -1.213432 -1.88262
H  -4.447272 0.312332 0.927646
H  -3.285123 1.524315 0.42586
H  -3.663878 0.871427 -1.985135
H  -4.812166 -0.355191 -1.468008
H  -5.171088 1.348246 -1.209691
H  -0.693179 1.849095 -1.338815
H  3.381837 2.023691 1.411051
H  0.662722 3.890703 -1.316331
H  -0.052044 -3.80395 0.835757
H  -2.629753 -4.498399 -2.334084
totalener: -1777.70275104 hartree
nucrepener: 2021.41720091 hartree
electener: -3799.11995196 hartree
oneelecener: -6456.10433334 hartree
twoeener: 2656.98438139 hartree
kineticenergy: 1772.81266387 hartree
xcener: -124.637471915819 hartree
chargesum: 0.0000000
charge: -0.059833 -0.064334 -0.360464 -0.346072 0.106752 -0.299699 -0.328800 0.558899 0.099645 0.034493 -0.132896 -0.098366 -0.144638 -0.233849 -0.012437 -0.133534 -0.156637 -0.156694 0.030808 0.108152 0.045025 0.075597 0.071820 0.102051 0.136910 0.123046 0.070307 0.058061 0.089822 0.075368 0.085539 0.141729 0.113713 0.124666 0.145262 0.130586
qa: -0.0598 -0.0643 -0.3605 -0.3461 0.1068 -0.2997 -0.3288 0.5589 0.0996 0.0345 -0.1329 -0.0984 -0.1446 -0.2338 -0.0124 -0.1335 -0.1566 -0.1567 0.0308 0.1082 0.0450 0.0756 0.0718 0.1021 0.1369 0.1230 0.0703 0.0581 0.0898 0.0754 0.0855 0.1417 0.1137 0.1247 0.1453 0.1306
va: 1.2618 1.2411 2.0192 2.0056 3.3650 2.8638 3.0554 3.8773 3.9423 3.9460 3.8114 3.5950 3.9604 3.9341 4.0239 3.9664 4.0869 4.0506 4.0793 3.9244 4.0511 0.9947 1.0078 0.9974 1.0194 1.0249 1.0108 1.0152 1.0095 1.0072 1.0039 1.0208 1.0281 1.0143 1.0108 1.0023
dispcorr: -0.020313527 hartree
energy: -1777.723064571147
dipole: -31.60453 31.26330 -0.34123 -7.53616 8.54666 1.01051 -6.23568 6.61669 0.38102
magnitude: 1.13258 au
magnitude: 2.87879 debye
