program: Orca
programVersion: 4.2.1
elementType: Cl Cl O O N N N C C C C C C C C C C C C C C H H H H H H H H H H H H H H H
charge: 0
multiplicity: 1
keywords: wb97x-d3
keywords: def2-TZVPP
keywords: def2/J RIJCOSX GRIDX6 NOFINALGRIDX
keywords: grid4 nofinalgrid
keywords: scfconv7
keywords: smallprint printgap noloewdin
keywords: NOSOSCF
formula: C14H15Cl2N3O2
InChI: InChI=1/C14H15Cl2N3O2/c1-2-11-6-20-14(21-11,7-19-9-17-8-18-19)12-4-3-10(15)5-13(12)16/h3-5,8-9,11H,2,6-7H2,1H3
36 atoms
Cl 0.237927 0.998993 -2.382056
Cl 2.947061 4.401674 0.689412
O  -1.321272 -0.635154 -0.516645
O  -0.527411 -1.197175 1.480903
N  0.034986 -3.122268 -0.501805
N  0.24363 -4.083647 0.402965
N  -1.343267 -4.708844 -1.052949
C  -0.142977 -0.776523 0.212878
C  -2.384767 -0.334556 0.372579
C  -1.766744 -0.585503 1.759403
C  0.722904 -1.86566 -0.425224
C  0.637917 0.537126 0.286248
C  -2.900842 1.080495 0.176835
C  -4.115154 1.36715 1.049627
C  0.836928 1.380915 -0.805277
C  1.214632 0.915301 1.49546
C  1.543267 2.569064 -0.686442
C  1.92656 2.093029 1.638414
C  -0.922301 -3.509435 -1.359059
C  2.077896 2.921086 0.539922
C  -0.600039 -5.013659 0.032875
H  -3.190999 -1.047646 0.168932
H  -1.629594 0.355059 2.309342
H  -2.353782 -1.262533 2.37934
H  1.623001 -2.014838 0.168546
H  1.026306 -1.550319 -1.423624
H  -2.101009 1.794126 0.396033
H  -3.16112 1.218963 -0.874577
H  -4.488195 2.37592 0.878549
H  -4.932075 0.675826 0.83613
H  -3.886218 1.286234 2.113957
H  1.099186 0.268323 2.354239
H  1.673932 3.209634 -1.546919
H  2.356548 2.361796 2.592802
H  -1.266092 -2.897073 -2.177409
H  -0.678999 -5.951507 0.559967
totalener: -1777.70086758 hartree
nucrepener: 2027.84069120 hartree
electener: -3805.54155878 hartree
oneelecener: -6468.82436750 hartree
twoeener: 2663.28280872 hartree
kineticenergy: 1772.81631371 hartree
xcener: -124.638617591320 hartree
chargesum: -0.0000000
charge: -0.056472 -0.062645 -0.359075 -0.332220 0.111051 -0.299382 -0.337544 0.588021 0.197350 -0.059199 -0.121578 -0.179879 -0.149784 -0.252804 -0.028116 -0.128239 -0.142224 -0.168476 0.036613 0.107618 0.054150 0.089045 0.081564 0.106226 0.122474 0.138577 0.059865 0.074513 0.093332 0.083110 0.073422 0.146392 0.113867 0.127568 0.143305 0.129572
qa: -0.0565 -0.0626 -0.3591 -0.3322 0.1111 -0.2994 -0.3375 0.5880 0.1973 -0.0592 -0.1216 -0.1799 -0.1498 -0.2528 -0.0281 -0.1282 -0.1422 -0.1685 0.0366 0.1076 0.0541 0.0890 0.0816 0.1062 0.1225 0.1386 0.0599 0.0745 0.0933 0.0831 0.0734 0.1464 0.1139 0.1276 0.1433 0.1296
va: 1.2619 1.2428 2.0107 2.0382 3.3521 2.8812 3.0600 3.8428 3.8294 3.9643 3.7974 3.5892 3.9675 3.9486 4.0214 3.9348 4.0761 4.0549 4.0808 3.9286 4.0610 1.0005 0.9918 0.9958 1.0272 1.0117 1.0034 1.0157 1.0057 1.0038 1.0051 1.0232 1.0284 1.0136 1.0116 1.0014
dispcorr: -0.020478586 hartree
energy: -1777.721346162131
dipole: -23.05062 22.74837 -0.30225 -8.56628 9.94830 1.38203 10.48913 -9.96672 0.52241
magnitude: 1.50807 au
magnitude: 3.83320 debye
