program: Orca
programVersion: 4.2.1
elementType: Cl Cl O O N N N C C C C C C C C C C C C C C H H H H H H H H H H H H H H H
charge: 0
multiplicity: 1
keywords: wb97x-d3
keywords: def2-TZVPP
keywords: def2/J RIJCOSX GRIDX6 NOFINALGRIDX
keywords: grid4 nofinalgrid
keywords: scfconv7
keywords: smallprint printgap noloewdin
keywords: NOSOSCF
formula: C14H15Cl2N3O2
InChI: InChI=1/C14H15Cl2N3O2/c1-2-11-6-20-14(21-11,7-19-9-17-8-18-19)12-4-3-10(15)5-13(12)16/h3-5,8-9,11H,2,6-7H2,1H3
36 atoms
Cl -0.455487 1.224163 -2.371409
Cl 3.708756 2.719015 0.59097
O  -2.382525 0.025402 -0.475495
O  -1.611522 -1.132786 1.291975
N  0.137786 -2.616317 -0.526389
N  0.033126 -3.598802 0.373475
N  2.173612 -3.322284 -0.238913
C  -1.271695 -0.660166 0.021187
C  -3.267288 0.298908 0.599881
C  -2.977922 -0.874075 1.526798
C  -1.00286 -1.842273 -0.929551
C  -0.038121 0.228975 0.145978
C  -3.021911 1.661541 1.231629
C  -3.127291 2.809779 0.239886
C  0.392503 1.082067 -0.867481
C  0.74864 0.157366 1.292451
C  1.53741 1.854362 -0.734912
C  1.898966 0.910075 1.444722
C  1.424804 -2.46121 -0.875918
C  2.283948 1.763651 0.425807
C  1.274493 -3.992991 0.512798
H  -4.282418 0.259089 0.194428
H  -3.115755 -0.63912 2.583542
H  -3.592999 -1.748068 1.283591
H  -0.839172 -1.475132 -1.942296
H  -1.873743 -2.497277 -0.945301
H  -3.761602 1.792782 2.027498
H  -2.043422 1.6771 1.72055
H  -2.385971 2.723448 -0.55277
H  -4.112052 2.84128 -0.229707
H  -2.971341 3.76613 0.737935
H  0.456228 -0.511606 2.088497
H  1.840933 2.515528 -1.53397
H  2.490623 0.826955 2.345121
H  1.75779 -1.721851 -1.588692
H  1.542179 -4.800963 1.175474
totalener: -1777.69875142 hartree
nucrepener: 2073.15594046 hartree
electener: -3850.85469188 hartree
oneelecener: -6559.71849487 hartree
twoeener: 2708.86380299 hartree
kineticenergy: 1772.80915175 hartree
xcener: -124.638127094489 hartree
chargesum: 0.0000000
charge: -0.062010 -0.063737 -0.341794 -0.342189 0.118117 -0.295827 -0.325728 0.532106 0.165377 -0.001653 -0.140868 -0.130979 -0.173146 -0.247178 -0.042376 -0.112756 -0.124693 -0.130963 0.027658 0.100289 0.055956 0.092610 0.079725 0.080678 0.133559 0.103426 0.068832 0.080013 0.088454 0.072860 0.087253 0.135497 0.113487 0.126544 0.143191 0.130264
qa: -0.0620 -0.0637 -0.3418 -0.3422 0.1181 -0.2958 -0.3257 0.5321 0.1654 -0.0017 -0.1409 -0.1310 -0.1731 -0.2472 -0.0424 -0.1128 -0.1247 -0.1310 0.0277 0.1003 0.0560 0.0926 0.0797 0.0807 0.1336 0.1034 0.0688 0.0800 0.0885 0.0729 0.0873 0.1355 0.1135 0.1265 0.1432 0.1303
va: 1.2569 1.2417 2.0368 2.0107 3.3160 2.8841 3.0638 3.9126 3.8969 4.0357 3.9146 3.5337 3.9264 3.9502 3.9685 3.8856 4.0726 4.0429 4.0902 3.9396 4.0539 0.9930 0.9920 0.9964 1.0150 1.0279 1.0119 1.0007 1.0172 1.0049 1.0069 1.0332 1.0276 1.0115 0.9997 1.0018
dispcorr: -0.022107935 hartree
energy: -1777.720859359355
dipole: -24.06092 22.64492 -1.41600 -2.63547 3.38446 0.74898 9.29716 -8.99035 0.30681
magnitude: 1.63100 au
magnitude: 4.14568 debye
