program: Orca
programVersion: 4.2.1
elementType: Cl F O N N N C C C C C C C C C C C C C C C C C H H H H H H H H H H H H H
charge: 0
multiplicity: 1
keywords: wb97x-d3
keywords: def2-TZVPP
keywords: def2/J RIJCOSX GRIDX6 NOFINALGRIDX
keywords: grid4 nofinalgrid
keywords: scfconv7
keywords: smallprint printgap noloewdin
keywords: NOSOSCF
formula: C17H13ClFN3O
InChI: InChI=1/C17H13ClFN3O/c18-15-4-2-1-3-14(15)16-17(23-16,9-22-11-20-10-21-22)12-5-7-13(19)8-6-12/h1-8,10-11,16H,9H2
36 atoms
Cl -1.496814 -0.048232 2.400055
F  5.629941 -0.829252 0.469164
O  0.236927 2.197489 -0.961462
N  -0.503096 -1.397629 -1.311061
N  0.437916 -2.339848 -1.392825
N  -1.404996 -3.157358 -0.420607
C  0.431287 0.811697 -0.754065
C  -0.340222 1.629416 0.195459
C  -0.275056 -0.054222 -1.782681
C  1.820095 0.398441 -0.400913
C  -1.823057 1.587605 0.270399
C  2.891318 0.834488 -1.173021
C  2.055119 -0.454415 0.670326
C  -2.455716 0.846317 1.264532
C  -2.620553 2.280595 -0.634759
C  4.18415 0.425419 -0.884703
C  3.340941 -0.874746 0.972816
C  -1.597054 -1.899072 -0.728151
C  -3.835573 0.779984 1.359944
C  -4.003643 2.223423 -0.553639
C  4.382111 -0.426859 0.184296
C  -4.61061 1.473323 0.44231
C  -0.144729 -3.375606 -0.846826
H  0.160939 1.901059 1.123858
H  0.325876 -0.109501 -2.690621
H  -1.236462 0.377403 -2.057447
H  2.726048 1.501557 -2.009926
H  1.232964 -0.796232 1.285878
H  -2.151864 2.870165 -1.411742
H  5.021451 0.764486 -1.480437
H  3.528213 -1.538305 1.80673
H  -2.498113 -1.326197 -0.571622
H  -4.300927 0.189549 2.137582
H  -4.605989 2.766313 -1.269548
H  -5.689007 1.422483 0.510733
H  0.353857 -4.328159 -0.757228
elementType: Cl F O N C H
totalener: -1455.22879690 hartree
nucrepener: 2050.67651090 hartree
electener: -3505.90530780 hartree
oneelecener: -6066.18482633 hartree
twoeener: 2560.27951853 hartree
cpcmener: -0.02582794 hartree
kineticenergy: 1450.53811025 hartree
xcener: -115.879240052351 hartree
chargesum: 0.0000000
charge: -0.086211 -0.221865 -0.415692 0.118181 -0.344578 -0.402840 0.269402 0.152748 -0.082337 0.066195 0.106942 -0.209527 -0.215108 -0.126598 -0.175885 -0.201225 -0.202470 0.050214 -0.122577 -0.149167 0.293323 -0.152380 0.070665 0.146449 0.137087 0.146022 0.145793 0.142381 0.154989 0.151982 0.150989 0.175892 0.144310 0.162273 0.161707 0.160915
qa: -0.0862 -0.2219 -0.4157 0.1182 -0.3446 -0.4028 0.2694 0.1527 -0.0823 0.0662 0.1069 -0.2095 -0.2151 -0.1266 -0.1759 -0.2012 -0.2025 0.0502 -0.1226 -0.1492 0.2933 -0.1524 0.0707 0.1464 0.1371 0.1460 0.1458 0.1424 0.1550 0.1520 0.1510 0.1759 0.1443 0.1623 0.1617 0.1609
va: 1.2448 1.0570 1.9943 3.3250 2.8837 3.0333 3.6236 3.7829 3.8629 3.3988 3.3185 3.9708 3.8932 3.9647 3.8929 3.8889 3.9389 4.0757 3.9498 3.9212 3.9116 3.9305 4.0321 0.9974 1.0096 0.9993 1.0083 1.0112 1.0147 0.9983 0.9981 0.9882 1.0046 0.9894 0.9878 0.9952
dispcorr: -0.021342127 hartree
energy: -1455.250139024308
dipole: -9.86332 8.29108 -1.57224 4.31254 -2.89352 1.41902 -8.75709 8.20353 -0.55356
magnitude: 2.18907 au
magnitude: 5.56416 debye
