program: Orca
programVersion: 4.2.1
elementType: Cl F O N N N C C C C C C C C C C C C C C C C C H H H H H H H H H H H H H
charge: 0
multiplicity: 1
keywords: wb97x-d3
keywords: def2-TZVPP
keywords: def2/J RIJCOSX GRIDX6 NOFINALGRIDX
keywords: grid4 nofinalgrid
keywords: scfconv7
keywords: smallprint printgap noloewdin
keywords: NOSOSCF
formula: C17H13ClFN3O
InChI: InChI=1/C17H13ClFN3O/c18-15-4-2-1-3-14(15)16-17(23-16,9-22-11-20-10-21-22)12-5-7-13(19)8-6-12/h1-8,10-11,16H,9H2
36 atoms
Cl -0.775324 0.162483 2.60888
F  6.181103 0.408087 0.607786
O  0.240671 1.037513 -1.503527
N  -1.082881 -1.55598 -1.223651
N  -1.519079 -1.267482 -2.451265
N  -3.19191 -2.064285 -1.192172
C  0.731332 0.061214 -0.615357
C  -0.142298 1.145768 -0.145149
C  0.293049 -1.374043 -0.849498
C  2.189909 0.156322 -0.295613
C  -1.585654 1.008586 0.178257
C  3.071014 0.77421 -1.17505
C  2.679085 -0.377128 0.893551
C  -1.988206 0.604026 1.445907
C  -2.5682 1.33869 -0.747876
C  4.423084 0.862195 -0.876704
C  4.026729 -0.2982 1.20632
C  -2.091482 -2.030005 -0.484579
C  -3.324789 0.510646 1.795328
C  -3.911484 1.254536 -0.413686
C  4.875577 0.322832 0.310567
C  -4.289552 0.839582 0.85457
C  -2.786576 -1.584569 -2.385886
H  0.356153 1.951747 0.395263
H  0.473667 -1.959363 0.052666
H  0.9199 -1.802266 -1.63461
H  2.711157 1.196958 -2.103494
H  2.008642 -0.850918 1.599593
H  -2.277346 1.659063 -1.739664
H  5.110934 1.344678 -1.558638
H  4.407258 -0.705334 2.133721
H  -1.972098 -2.340877 0.541399
H  -3.611407 0.180201 2.78487
H  -4.663788 1.508515 -1.148615
H  -5.337342 0.765893 1.117805
H  -3.446556 -1.471663 -3.232204
elementType: Cl F O N C H
totalener: -1455.22643249 hartree
nucrepener: 2058.05040254 hartree
electener: -3513.27683503 hartree
oneelecener: -6081.11391918 hartree
twoeener: 2567.83708415 hartree
cpcmener: -0.02708239 hartree
kineticenergy: 1450.52505313 hartree
xcener: -115.880415509471 hartree
chargesum: -0.0000000
charge: -0.093504 -0.221853 -0.418919 0.116918 -0.334313 -0.391036 0.344202 0.081956 -0.069103 0.005803 0.096439 -0.159541 -0.200995 -0.045141 -0.150714 -0.211477 -0.218707 0.055241 -0.149053 -0.154241 0.299878 -0.141660 0.046566 0.137982 0.131514 0.137043 0.145565 0.135340 0.139250 0.151885 0.151782 0.168398 0.140415 0.155756 0.159526 0.158797
qa: -0.0935 -0.2219 -0.4189 0.1169 -0.3343 -0.3910 0.3442 0.0820 -0.0691 0.0058 0.0964 -0.1595 -0.2010 -0.0451 -0.1507 -0.2115 -0.2187 0.0552 -0.1491 -0.1542 0.2999 -0.1417 0.0466 0.1380 0.1315 0.1370 0.1456 0.1353 0.1393 0.1519 0.1518 0.1684 0.1404 0.1558 0.1595 0.1588
va: 1.2415 1.0567 1.9854 3.3784 2.8707 3.0165 3.6076 3.8671 3.8113 3.4411 3.4283 3.9308 3.9489 3.8880 3.8319 3.9082 3.9579 4.0729 3.9647 3.9106 3.9060 3.9068 4.0606 0.9954 1.0041 1.0084 1.0183 1.0159 1.0215 0.9994 0.9990 0.9925 1.0060 0.9922 0.9872 0.9976
dispcorr: -0.022122198 hartree
energy: -1455.248554692434
dipole: -9.78170 9.79747 0.01578 -1.09073 0.94066 -0.15007 -6.53151 7.47959 0.94809
magnitude: 0.96002 au
magnitude: 2.44018 debye
