program: Orca
programVersion: 4.2.1
elementType: Cl F O N N N C C C C C C C C C C C C C C C C C H H H H H H H H H H H H H
charge: 0
multiplicity: 1
keywords: wb97x-d3
keywords: def2-TZVPP
keywords: def2/J RIJCOSX GRIDX6 NOFINALGRIDX
keywords: grid4 nofinalgrid
keywords: scfconv7
keywords: smallprint printgap noloewdin
keywords: NOSOSCF
formula: C17H13ClFN3O
InChI: InChI=1/C17H13ClFN3O/c18-15-4-2-1-3-14(15)16-17(23-16,9-22-11-20-10-21-22)12-5-7-13(19)8-6-12/h1-8,10-11,16H,9H2
36 atoms
Cl -1.545598 -0.254657 2.434484
F  5.569941 -0.894935 0.38607
O  0.183602 2.293637 -0.709288
N  -0.385094 -1.269358 -1.498789
N  -1.24263 -1.746249 -0.593403
N  0.024869 -3.401243 -1.419464
C  0.381846 0.898028 -0.647377
C  -0.392561 1.606396 0.381479
C  -0.310683 0.140551 -1.766742
C  1.767793 0.44297 -0.340146
C  -1.873236 1.554143 0.455215
C  1.979055 -0.66565 0.472894
C  2.860872 1.098101 -0.8947
C  -2.501703 0.721749 1.37527
C  -2.667701 2.339969 -0.371545
C  3.262268 -1.125296 0.721639
C  4.150472 0.651536 -0.652918
C  0.371518 -2.269121 -1.974577
C  -3.880974 0.657219 1.466001
C  -4.050193 2.284684 -0.291621
C  4.329032 -0.45825 0.150555
C  -4.65598 1.44146 0.626119
C  -0.964424 -3.027264 -0.581009
H  0.113731 1.769017 1.332288
H  0.255573 0.279103 -2.689831
H  -1.31889 0.519622 -1.931969
H  1.135164 -1.169718 0.927888
H  2.710004 1.973415 -1.513243
H  -2.190848 3.003407 -1.080702
H  3.432913 -1.987197 1.352115
H  5.006177 1.159021 -1.077345
H  1.149306 -2.123492 -2.708421
H  -4.342859 -0.004347 2.185487
H  -4.652266 2.903141 -0.943334
H  -5.73428 1.390804 0.694261
H  -1.498789 -3.718402 0.051692
totalener: -1455.20468432 hartree
nucrepener: 2051.28387696 hartree
electener: -3506.48856128 hartree
oneelecener: -6067.41730642 hartree
twoeener: 2560.92874514 hartree
kineticenergy: 1450.54400838 hartree
xcener: -115.878955646165 hartree
chargesum: 0.0000000
charge: -0.077309 -0.199844 -0.377543 0.127887 -0.327562 -0.322195 0.271727 0.119002 -0.115837 0.031177 0.092479 -0.182904 -0.162133 -0.028837 -0.185762 -0.162748 -0.175524 0.038518 -0.132232 -0.118450 0.270872 -0.123030 0.070912 0.126895 0.113453 0.131019 0.118804 0.130014 0.143518 0.129327 0.127577 0.142614 0.117502 0.130288 0.127925 0.130402
qa: -0.0773 -0.1998 -0.3775 0.1279 -0.3276 -0.3222 0.2717 0.1190 -0.1158 0.0312 0.0925 -0.1829 -0.1621 -0.0288 -0.1858 -0.1627 -0.1755 0.0385 -0.1322 -0.1185 0.2709 -0.1230 0.0709 0.1269 0.1135 0.1310 0.1188 0.1300 0.1435 0.1293 0.1276 0.1426 0.1175 0.1303 0.1279 0.1304
va: 1.2543 1.0892 2.0385 3.2695 2.8305 3.0629 3.6636 3.8788 3.9289 3.4396 3.4557 3.9053 3.9555 4.0276 3.9230 3.9443 3.9103 4.0817 4.0469 3.9591 3.9921 3.9739 4.0375 1.0023 1.0073 1.0055 1.0242 1.0155 1.0185 1.0055 1.0069 1.0016 1.0134 1.0000 0.9989 1.0026
dispcorr: -0.020993400 hartree
energy: -1455.225677723967
dipole: -8.63529 8.00819 -0.62710 4.90568 -4.04635 0.85934 -8.87894 8.33952 -0.53942
magnitude: 1.19276 au
magnitude: 3.03177 debye
