program: Orca
programVersion: 4.2.1
elementType: Cl F O N N N C C C C C C C C C C C C C C C C C H H H H H H H H H H H H H
charge: 0
multiplicity: 1
keywords: wb97x-d3
keywords: def2-TZVPP
keywords: def2/J RIJCOSX GRIDX6 NOFINALGRIDX
keywords: grid4 nofinalgrid
keywords: scfconv7
keywords: smallprint printgap noloewdin
keywords: NOSOSCF
formula: C17H13ClFN3O
InChI: InChI=1/C17H13ClFN3O/c18-15-4-2-1-3-14(15)16-17(23-16,9-22-11-20-10-21-22)12-5-7-13(19)8-6-12/h1-8,10-11,16H,9H2
36 atoms
Cl -0.771808 1.481276 2.99591
F  5.541776 -0.626455 -0.257375
O  -0.51725 0.949947 -1.336583
N  -0.416192 -2.178788 -1.148464
N  -0.987938 -2.139694 -2.35484
N  0.584113 -3.738113 -2.283156
C  0.003705 0.086844 -0.352353
C  -0.614189 1.372019 0.002239
C  -0.751543 -1.209061 -0.139082
C  1.487498 -0.055761 -0.329846
C  -1.979259 1.466434 0.581451
C  2.211552 -0.087956 -1.515038
C  2.15313 -0.219509 0.879706
C  -2.159034 1.546847 1.957554
C  -3.107074 1.494907 -0.231257
C  3.583907 -0.280739 -1.497359
C  3.524885 -0.412392 0.913965
C  0.529021 -3.130583 -1.126863
C  -3.417782 1.661178 2.522107
C  -4.373909 1.607643 0.319071
C  4.218723 -0.441255 -0.281193
C  -4.528912 1.692955 1.694145
C  -0.361446 -3.093539 -2.99899
H  0.065111 2.177556 0.281463
H  -1.82896 -1.053234 -0.15819
H  -0.489962 -1.623113 0.836007
H  1.702013 0.035451 -2.461419
H  1.598291 -0.183333 1.809751
H  -2.982326 1.422216 -1.303301
H  4.153814 -0.310947 -2.416005
H  4.050466 -0.531561 1.8517
H  1.13836 -3.337134 -0.260162
H  -3.525932 1.719919 3.596217
H  -5.240157 1.628882 -0.327978
H  -5.515032 1.784204 2.128935
H  -0.599749 -3.33944 -4.021932
totalener: -1455.20401306 hartree
nucrepener: 2008.52394513 hartree
electener: -3463.72795820 hartree
oneelecener: -5981.45132460 hartree
twoeener: 2517.72336641 hartree
kineticenergy: 1450.54768974 hartree
xcener: -115.877097273504 hartree
chargesum: -0.0000000
charge: -0.079350 -0.199305 -0.362677 0.110113 -0.298162 -0.326673 0.360153 0.082218 -0.095271 -0.046846 0.005317 -0.119675 -0.199712 -0.030437 -0.123437 -0.170153 -0.187751 0.033380 -0.140198 -0.127815 0.283645 -0.115774 0.056933 0.129917 0.130842 0.114468 0.132511 0.118880 0.146801 0.128374 0.128043 0.139993 0.123469 0.134202 0.132682 0.131295
qa: -0.0794 -0.1993 -0.3627 0.1101 -0.2982 -0.3267 0.3602 0.0822 -0.0953 -0.0468 0.0053 -0.1197 -0.1997 -0.0304 -0.1234 -0.1702 -0.1878 0.0334 -0.1402 -0.1278 0.2836 -0.1158 0.0569 0.1299 0.1308 0.1145 0.1325 0.1189 0.1468 0.1284 0.1280 0.1400 0.1235 0.1342 0.1327 0.1313
va: 1.2571 1.0903 2.0366 3.3277 2.8713 3.0635 3.5790 3.8743 3.8897 3.4567 3.4819 3.8994 3.9327 4.0049 3.9175 3.9236 3.9653 4.0878 4.0180 3.9617 3.9842 3.9586 4.0512 0.9960 1.0076 1.0040 1.0209 1.0285 1.0195 1.0067 1.0067 1.0021 1.0115 0.9998 0.9978 1.0016
dispcorr: -0.019841308 hartree
energy: -1455.223854371369
dipole: -11.35288 10.38291 -0.96998 -1.90225 2.59744 0.69519 -4.34908 5.56361 1.21453
magnitude: 1.70271 au
magnitude: 4.32795 debye
