program: Orca
programVersion: 4.2.1
elementType: Cl F O N N N C C C C C C C C C C C C C C C C C H H H H H H H H H H H H H
charge: 0
multiplicity: 1
keywords: wb97x-d3
keywords: def2-TZVPP
keywords: def2/J RIJCOSX GRIDX6 NOFINALGRIDX
keywords: grid4 nofinalgrid
keywords: scfconv7
keywords: smallprint printgap noloewdin
keywords: NOSOSCF
formula: C17H13ClFN3O
InChI: InChI=1/C17H13ClFN3O/c18-15-4-2-1-3-14(15)16-17(23-16,9-22-11-20-10-21-22)12-5-7-13(19)8-6-12/h1-8,10-11,16H,9H2
36 atoms
Cl 0.049872 -3.151487 1.701927
F  -2.893288 3.321431 1.259844
O  1.035226 -0.666422 -1.758326
N  2.832789 1.398494 -0.138202
N  3.279598 1.741916 -1.348977
N  2.993108 3.564276 -0.069243
C  1.062931 -0.251915 -0.405958
C  0.736396 -1.635652 -0.772838
C  2.430306 0.047125 0.16395
C  -0.014102 0.688171 0.014275
C  -0.662748 -2.121763 -0.690955
C  -0.504392 0.629708 1.314576
C  -0.502929 1.652917 -0.857174
C  -1.080444 -2.848008 0.419014
C  -1.592953 -1.858646 -1.689303
C  -1.479544 1.515057 1.744538
C  -1.47771 2.548783 -0.442452
C  2.650546 2.492128 0.601499
C  -2.377781 -3.314471 0.542972
C  -2.896911 -2.318137 -1.581658
C  -1.947539 2.460571 0.852478
C  -3.288622 -3.046977 -0.468324
C  3.3659 3.04288 -1.252157
H  1.508194 -2.391891 -0.637005
H  3.179566 -0.641701 -0.223407
H  2.410262 -0.063691 1.247461
H  -0.135138 -0.119259 2.004478
H  -0.133522 1.713664 -1.872101
H  -1.294956 -1.287572 -2.557885
H  -1.869935 1.466353 2.752159
H  -1.862944 3.301324 -1.117378
H  2.286782 2.459411 1.616403
H  -2.676017 -3.874648 1.418446
H  -3.607187 -2.104959 -2.368844
H  -4.304229 -3.407498 -0.378378
H  3.721327 3.645022 -2.073441
elementType: Cl F O N C H
totalener: -1455.22442615 hartree
nucrepener: 2047.54009119 hartree
electener: -3502.76451734 hartree
oneelecener: -6059.98618218 hartree
twoeener: 2557.22166484 hartree
cpcmener: -0.03337027 hartree
kineticenergy: 1450.58079186 hartree
xcener: -115.886364980756 hartree
chargesum: -0.0000000
charge: -0.093477 -0.223654 -0.425943 0.114083 -0.351854 -0.409836 0.307063 0.085277 -0.054697 0.072687 0.117999 -0.252142 -0.169388 -0.058904 -0.153314 -0.199859 -0.206794 0.060326 -0.152291 -0.164884 0.301885 -0.156361 0.062266 0.147093 0.124052 0.126227 0.143464 0.141380 0.148224 0.155062 0.155010 0.173438 0.145538 0.164665 0.164996 0.162661
qa: -0.0935 -0.2237 -0.4259 0.1141 -0.3519 -0.4098 0.3071 0.0853 -0.0547 0.0727 0.1180 -0.2521 -0.1694 -0.0589 -0.1533 -0.1999 -0.2068 0.0603 -0.1523 -0.1649 0.3019 -0.1564 0.0623 0.1471 0.1241 0.1262 0.1435 0.1414 0.1482 0.1551 0.1550 0.1734 0.1455 0.1647 0.1650 0.1627
va: 1.2358 1.0544 1.9640 3.3646 2.8923 3.0254 3.6285 3.8505 3.8952 3.3348 3.4206 3.9344 3.8624 3.9419 3.8836 3.9350 3.9195 4.0662 3.9765 3.9197 3.9052 3.9165 4.0529 0.9983 1.0116 1.0017 1.0136 1.0211 1.0141 0.9966 0.9965 0.9944 1.0041 0.9885 0.9863 0.9959
dispcorr: -0.020866525 hartree
energy: -1455.245292677610
dipole: 0.16178 -1.02124 -0.85946 -0.21007 -1.55942 -1.76949 -5.60121 6.61170 1.01049
magnitude: 2.21153 au
magnitude: 5.62125 debye
