program: Orca
programVersion: 4.2.1
elementType: Cl F O N N N C C C C C C C C C C C C C C C C C H H H H H H H H H H H H H
charge: 0
multiplicity: 1
keywords: wb97x-d3
keywords: def2-TZVPP
keywords: def2/J RIJCOSX GRIDX6 NOFINALGRIDX
keywords: grid4 nofinalgrid
keywords: scfconv7
keywords: smallprint printgap noloewdin
keywords: NOSOSCF
formula: C17H13ClFN3O
InChI: InChI=1/C17H13ClFN3O/c18-15-4-2-1-3-14(15)16-17(23-16,9-22-11-20-10-21-22)12-5-7-13(19)8-6-12/h1-8,10-11,16H,9H2
36 atoms
Cl 1.346008 -2.184076 1.187562
F  -3.384505 3.126777 1.485955
O  0.021315 -0.355151 -2.581106
N  2.546649 1.267724 -0.490054
N  3.354753 0.29745 -0.054422
N  3.241749 1.95958 1.448275
C  0.481905 0.355643 -1.447767
C  0.489248 -1.113076 -1.48023
C  1.775941 1.110067 -1.697066
C  -0.558727 1.078573 -0.662351
C  -0.527792 -1.900443 -0.736353
C  -0.529753 1.067094 0.728434
C  -1.556592 1.793212 -1.315637
C  -0.224312 -2.455014 0.502907
C  -1.804349 -2.106024 -1.24804
C  -1.479787 1.759941 1.46339
C  -2.516399 2.489005 -0.596625
C  2.481098 2.24198 0.41909
C  -1.149395 -3.195114 1.219878
C  -2.741681 -2.847265 -0.54494
C  -2.457196 2.458389 0.782957
C  -2.414762 -3.392632 0.687802
C  3.744294 0.75762 1.104427
H  1.443415 -1.610826 -1.645332
H  1.559508 2.098839 -2.10077
H  2.388332 0.582076 -2.426075
H  0.226817 0.501418 1.257133
H  -1.597704 1.810825 -2.396857
H  -2.067838 -1.681925 -2.20709
H  -1.462547 1.747815 2.544874
H  -3.29692 3.041816 -1.102055
H  1.892819 3.135289 0.282234
H  -0.887215 -3.609714 2.18361
H  -3.728149 -2.9980 -0.961854
H  -3.14139 -3.971079 1.241942
H  4.434878 0.20923 1.725449
elementType: Cl F O N C H
totalener: -1455.22195152 hartree
nucrepener: 2078.98050864 hartree
electener: -3534.20246016 hartree
oneelecener: -6123.12954386 hartree
twoeener: 2588.92708370 hartree
cpcmener: -0.02905436 hartree
kineticenergy: 1450.56635562 hartree
xcener: -115.884352651982 hartree
chargesum: -0.0000000
charge: -0.094435 -0.223547 -0.428587 0.104690 -0.341044 -0.409365 0.257268 0.145615 -0.044650 0.122246 0.092344 -0.291930 -0.195720 -0.042787 -0.149211 -0.186975 -0.197319 0.043003 -0.157528 -0.168677 0.286824 -0.155734 0.065878 0.138960 0.132789 0.120468 0.153390 0.146319 0.147360 0.154690 0.155370 0.184919 0.145587 0.164676 0.164727 0.160386
qa: -0.0944 -0.2235 -0.4286 0.1047 -0.3410 -0.4094 0.2573 0.1456 -0.0446 0.1222 0.0923 -0.2919 -0.1957 -0.0428 -0.1492 -0.1870 -0.1973 0.0430 -0.1575 -0.1687 0.2868 -0.1557 0.0659 0.1390 0.1328 0.1205 0.1534 0.1463 0.1474 0.1547 0.1554 0.1849 0.1456 0.1647 0.1647 0.1604
va: 1.2423 1.0547 1.9754 3.3604 2.8702 3.0174 3.6660 3.7754 3.8392 3.2705 3.4288 3.9157 3.9396 3.9403 3.8852 3.9366 3.8860 4.0773 3.9800 3.9205 3.9200 3.9170 4.0328 1.0129 1.0038 1.0174 1.0090 1.0109 1.0169 0.9961 0.9966 0.9877 1.0042 0.9888 0.9865 0.9968
dispcorr: -0.021695179 hartree
energy: -1455.243646699125
dipole: -2.58220 1.50772 -1.07449 -0.71343 0.63900 -0.07443 -6.51244 5.47020 -1.04224
magnitude: 1.49878 au
magnitude: 3.80958 debye
