program: Gaussian 09
title: 000073577
version: EM64L-G09RevD.01
frameworkgroup: C1[X(C20H21N7O6)]
method: RPBEPBE
basis: SDD
operation: Freq
keyword: #p
keyword: freq=noraman
keyword: PBEPBE/SDD
title: #p freq=noraman PBEPBE/SDD
converged: YES YES NO NO
title: Mulliken charges:
elementType: O O O O O O N N N N N N N C C C C C C C C C C C C C C C C C C C C H H H H H H H H H H H H H H H H H H H H H
charge: -0.401764 -0.302634 -0.240113 -0.418971 -0.227754 -0.208174 -0.461049 -0.429743 -0.043832 -0.018615 -0.409628 -0.031461 -0.609904 -0.133219 -0.392298 -0.485340 -0.359517 -0.566712 0.284027 0.447092 0.153930 0.110741 0.324515 -0.373121 -0.323231 -0.375701 -0.452040 0.179514 -0.145460 -0.446749 0.171527 0.011762 0.161867 0.308261 0.285480 0.245533 0.274117 0.255063 0.340839 0.213254 0.229595 0.247733 0.217801 0.391081 0.268787 0.203382 0.231072 0.259887 0.261087 0.330046 0.386420 0.375894 0.321958 0.364764
chargesum: 0.00000
title: Mulliken charges with hydrogens summed into heavy atoms:
elementType: O O O O O O N N N N N N N C C C C C C C C C C C C C C C C C C C C
charge: -0.015345 -0.302634 -0.240113 -0.043077 -0.227754 -0.208174 -0.120210 -0.038662 -0.043832 -0.018615 -0.079582 -0.031461 0.076817 0.175042 0.138716 0.043840 0.083332 -0.101177 0.284027 0.447092 0.153930 0.110741 0.324515 -0.104334 -0.119848 -0.144629 -0.192153 0.179514 -0.145460 -0.185662 0.171527 0.011762 0.161867
polarizability: 5.34802919e+02 2.07254675e+01 3.27166346e+02 1.00909361e+01 1.88629860e+01 1.82303467e+02
1716.lowfreq: -2.6658 -0.0008 -0.0004 0.0006 1.4882 3.9382 7.3037 11.9461 16.2303
frequency: 5.8692 11.6406 16.1951 20.0495 27.1777 36.9461 46.2586 51.4469 54.3652 61.0358 73.2148 80.8377 93.7463 106.5072 126.8461 142.3414 150.2815 152.8397 161.9527 187.3653 195.8781 212.9984 231.9506 236.7994 286.4047 298.1318 317.7258 324.1220 327.0634 340.3511 374.7113 386.7261 406.5290 410.7739 424.2396 443.2079 448.9989 462.7478 476.1267 494.7587 503.7985 515.1117 536.2158 537.8401 558.7927 560.1751 575.4530 580.8641 589.4453 608.7077 625.3860 627.6632 633.3372 635.6655 638.6595 646.1568 678.9349 684.5398 699.1480 724.6071 729.3539 742.1505 756.7823 770.5369 789.3308 805.0294 815.6574 822.7414 835.0076 838.2923 874.7785 898.6993 902.2856 907.5582 920.7111 935.3516 952.2612 961.3882 987.0058 994.7077 997.5745 1023.3476 1028.3920 1042.9222 1046.8625 1061.1873 1093.7220 1100.8367 1104.6811 1123.5050 1132.7003 1156.5314 1182.2505 1183.3175 1196.7956 1203.7214 1221.0839 1224.1277 1239.7527 1247.7466 1263.9687 1269.3505 1279.1101 1280.3574 1286.4990 1307.6456 1315.4515 1333.9013 1334.6059 1348.8108 1353.1465 1359.0265 1371.8925 1373.8373 1378.5196 1436.8760 1440.9212 1443.9239 1449.2091 1458.1717 1469.1823 1473.8225 1491.3293 1500.4249 1510.7307 1533.6735 1538.8741 1552.5390 1585.9680 1591.2331 1594.7755 1629.8451 1642.0924 1646.9782 1669.6188 2910.7253 2981.1213 2990.3519 2999.1680 3001.2505 3033.8092 3039.5082 3068.9896 3100.5224 3111.5192 3136.3825 3138.4878 3150.7733 3160.1294 3321.0605 3510.1785 3512.7869 3517.4875 3530.3945 3546.5959 3697.7230
redmass: 7.6172 7.5779 10.6052 8.8885 8.5431 7.2818 5.8130 7.8763 7.3879 5.0965 5.6201 6.2071 2.6528 6.3286 5.4517 5.9926 5.0001 5.5274 4.4777 5.6970 4.2291 5.8766 5.2023 2.9160 4.6690 5.7935 1.3857 4.9849 2.6233 7.0185 4.6805 3.8644 4.4226 2.9210 4.7580 7.1142 4.2844 4.7565 5.5443 3.4023 1.8332 3.2497 3.6877 4.4999 1.8521 1.4322 1.3956 3.6716 4.4840 3.4393 1.9871 4.6097 3.0084 2.0168 1.3609 3.8223 6.4627 3.8433 8.8583 4.0662 3.5673 1.7567 3.7662 1.9533 2.2254 3.4527 3.8280 2.0385 2.4922 1.9436 4.0235 4.4519 3.0901 4.8712 1.4400 2.8132 1.3665 3.5439 1.3570 2.2282 2.7113 2.7587 2.6617 2.7653 2.1054 2.1659 2.6510 2.6867 2.7742 3.2224 1.6177 1.7864 2.3236 1.5595 1.6479 1.2082 1.4389 1.3691 1.4245 2.4550 1.6928 4.1217 1.6798 1.9730 1.2880 1.4265 1.4675 1.5677 2.3618 2.6216 2.2367 1.9084 2.4155 2.5779 1.8081 7.0922 1.1981 3.3069 1.1085 3.6683 1.2045 1.8209 1.1865 1.7602 7.6426 4.0105 3.6324 3.6323 5.3458 3.4482 2.1656 6.0077 2.5154 8.4047 8.1978 1.0675 1.0861 1.0607 1.0814 1.0693 1.0635 1.0958 1.0993 1.1036 1.0874 1.0967 1.0873 1.0932 1.0961 1.0814 1.0778 1.0639 1.0642 1.0770 1.0458 1.1053
irintensity: 0.5623 1.6534 0.6399 1.1502 6.4584 0.9527 2.8219 0.6556 0.1698 3.5956 2.2861 0.8388 1.0271 4.7816 0.6426 4.1002 1.6071 0.2011 12.3438 0.9614 0.6032 9.7407 7.9585 4.8046 3.2204 7.6547 34.0921 3.0347 13.6040 4.5322 3.5099 0.9723 4.6577 0.3974 31.9709 2.7660 34.3804 1.5636 6.1663 4.1832 34.1537 19.7900 41.7089 58.2002 90.5439 331.1053 14.4444 4.6632 8.3695 10.1851 49.3380 17.0852 70.2674 30.2187 123.6066 18.2583 2.0760 46.7212 19.9529 27.4611 9.5451 50.5823 34.7039 35.7355 19.3322 26.8539 7.6778 11.5561 6.0951 72.7095 9.7778 17.9445 1.1099 6.5122 7.9031 4.8982 1.0949 4.1743 1.3044 5.2790 2.1952 121.5271 68.6800 279.3296 1.7025 144.6123 15.7079 93.9544 9.6404 11.6145 40.9869 4.8952 13.0803 8.3276 23.9388 124.3827 10.9726 16.6492 30.8464 5.1382 157.0654 36.3854 66.0511 29.6985 7.2805 12.4732 62.8660 45.3428 20.3441 21.7426 298.7128 95.5094 128.5048 64.3176 98.6573 204.6262 59.2563 25.3334 39.8246 17.7647 92.3473 656.7795 11.7341 33.0396 33.3121 44.4801 49.8449 355.1246 679.2590 211.8619 99.3020 423.3631 568.0784 160.1684 214.0045 76.2379 33.9376 11.4781 21.8597 42.6076 14.1361 6.4486 19.4402 10.7198 23.1600 10.4714 6.8221 12.0214 10.6118 291.9760 40.7570 20.6213 42.1130 40.0704 185.4109 48.5164
temp: 298.150 k
press: 1.00000 atm
elementType: 8 8 8 8 8 8 7 7 7 7 7 7 7 6 6 6 6 6 6 6 6 6 6 6 6 6 6 6 6 6 6 6 6 1 1 1 1 1 1 1 1 1 1 1 1 1 1 1 1 1 1 1 1 1
symmnumber: 1
zpe: 1068825.3 jmol-1
zpe.correction: 0.407094 hartree
zpe.thermalcorrener: 0.438011 hartree
zpe.thermalcorrenthalpy: 0.438955 hartree
zpe.thermalcorrgfe: 0.338028 hartree
zpe.sumelectzpe: -1607.007657 hartree
zpe.sumelectthermal: -1606.976741 hartree
zpe.sumelectthermalent: -1606.975796 hartree
zpe.sumelectthermalfe: -1607.076723 hartree
dipole: 13.4959 2.4037 -0.8182
dipole: 13.7326
quadrupole: -107.0506 -169.1138 -194.0786
quadrupole: -10.8040 -20.5479 -13.3518
quadrupole: 49.6971 -12.3662 -37.3309 -10.8040 -20.5479 -13.3518
hfenergy: -1607.4147514 hartree
pointgroup: C01 [X(C20H21N7O6)]
dipole: -5.3350082 -0.7787859 -0.3490449 debye
polarizability: 536.28441|12.9774126|322.5633145|-6.2642083|-28.4174428|185.4250083 unknown
InChI: InChI=1S/C20H21N7O6/c21-20-26-16-15(18(31)27-20)24-12(9-23-16)7-8-22-11-3-1-10(2-4-11)17(30)25-13(19(32)33)5-6-14(28)29/h1-4,9,13,22,25-26,28,32H,5-8,21H2
charge 0 multiplicity 1
54 atoms
O  6.859428 -3.054716 -1.461347
O  4.425527 1.362084 -1.8453
O  4.7573 -3.322887 -0.515295
O  7.42278 -0.224263 3.443335
O  8.37859 0.945562 1.680984
O  -3.259362 -1.615567 1.364592
N  4.19453 -0.654971 -0.738781
N  -1.7081 2.046647 0.15604
N  -4.219501 0.956972 0.549613
N  -6.758145 1.050151 -0.721656
N  -7.009994 -1.263912 -0.30458
N  -5.31193 -2.594971 0.787862
N  -7.32851 -3.56547 0.137701
C  5.555174 -1.055004 -1.104069
C  6.657397 -0.352927 -0.249945
C  6.510186 -0.631725 1.255141
C  -2.411629 3.190249 -0.427103
C  -3.820608 3.353767 0.206578
C  2.276485 0.896305 -0.802565
C  -0.411094 1.689203 -0.183981
C  3.685956 0.568337 -1.167943
C  5.641714 -2.570926 -0.988196
C  -4.704035 2.133987 0.042845
C  1.745237 2.123172 -1.279737
C  1.429771 0.065745 -0.010563
C  0.431069 2.519761 -0.987346
C  0.116028 0.445798 0.292851
C  7.530891 0.120198 2.084034
C  -4.962672 -0.17287 0.417813
C  -5.974992 2.158867 -0.598687
C  -6.243268 -0.102105 -0.208598
C  -4.426166 -1.499067 0.901071
C  -6.509975 -2.463772 0.223958
H  5.745475 -0.765792 -2.156881
H  6.574715 0.728745 -0.447672
H  7.647306 -0.681502 -0.611522
H  5.502473 -0.335873 1.606794
H  6.609553 -1.708227 1.496192
H  3.603072 -1.370126 -0.309059
H  -2.506461 3.087059 -1.532949
H  -1.848905 4.127647 -0.241603
H  -3.688672 3.550133 1.288404
H  -4.310105 4.238843 -0.236707
H  -2.314916 1.346021 0.613599
H  2.400509 2.755026 -1.889037
H  1.781257 -0.89414 0.387284
H  0.058264 3.472052 -1.378075
H  -0.526087 -0.210824 0.892701
H  -6.375385 3.086201 -1.02035
H  -7.920868 -1.185901 -0.765964
H  6.884484 -4.045174 -1.364259
H  8.095878 0.294525 3.962516
H  -8.265639 -3.546352 -0.25626
H  -6.952127 -4.434894 0.510721
