program: Orca
programVersion: 4.2.1
elementType: Cl F O N N N C C C C C C C C C C C C C C C C C H H H H H H H H H H H H H
charge: 0
multiplicity: 1
keywords: wb97x-d3
keywords: def2-TZVPP
keywords: def2/J RIJCOSX GRIDX6 NOFINALGRIDX
keywords: grid4 nofinalgrid
keywords: scfconv7
keywords: smallprint printgap noloewdin
keywords: NOSOSCF
formula: C17H13ClFN3O
InChI: InChI=1/C17H13ClFN3O/c18-15-4-2-1-3-14(15)16-17(23-16,9-22-11-20-10-21-22)12-5-7-13(19)8-6-12/h1-8,10-11,16H,9H2
36 atoms
Cl 0.167443 -1.492904 2.423845
F  -4.501928 2.661041 0.174455
O  0.950934 -0.074265 -1.601532
N  3.09975 1.152196 -0.304038
N  3.793225 0.361526 0.519275
N  4.940556 0.729537 -1.368394
C  0.682835 0.648099 -0.422062
C  0.886883 -0.806769 -0.389749
C  1.774565 1.612889 0.011067
C  -0.69809 1.195356 -0.277541
C  -0.273249 -1.719232 -0.227213
C  -1.153628 1.603139 0.973191
C  -1.548392 1.295343 -1.372544
C  -0.691325 -2.098123 1.043009
C  -0.975819 -2.207797 -1.322023
C  -2.436716 2.101837 1.135013
C  -2.835523 1.790986 -1.227593
C  3.791617 1.356565 -1.426776
C  -1.780575 -2.93092 1.235905
C  -2.065541 -3.047244 -1.148075
C  -3.256337 2.184202 0.026679
C  -2.469414 -3.405798 0.129562
C  4.889093 0.136866 -0.159306
H  1.841206 -1.191925 -0.033719
H  1.719648 1.797155 1.083213
H  1.622601 2.568903 -0.491071
H  -0.516277 1.523839 1.844578
H  -1.216461 0.983827 -2.353466
H  -0.668134 -1.927241 -2.320645
H  -2.792096 2.413259 2.108423
H  -3.498465 1.867366 -2.079515
H  3.426673 1.966262 -2.238528
H  -2.091368 -3.203452 2.235438
H  -2.60056 -3.418833 -2.011859
H  -3.32253 -4.055715 0.272405
H  5.685863 -0.475329 0.234201
elementType: Cl F O N C H
totalener: -1455.23152969 hartree
nucrepener: 2036.82996050 hartree
electener: -3492.06149019 hartree
oneelecener: -6038.65108601 hartree
twoeener: 2546.58959582 hartree
cpcmener: -0.02611059 hartree
kineticenergy: 1450.54177391 hartree
xcener: -115.880766354005 hartree
chargesum: -0.0000000
charge: -0.092366 -0.222433 -0.429787 0.094391 -0.365316 -0.412496 0.273454 0.118855 -0.028002 0.104785 0.144038 -0.254543 -0.207555 -0.050720 -0.178455 -0.199386 -0.198008 0.073298 -0.166302 -0.162065 0.292289 -0.147198 0.079211 0.142566 0.127577 0.130802 0.135208 0.147240 0.146280 0.152450 0.151259 0.175653 0.141413 0.160410 0.161325 0.162125
qa: -0.0924 -0.2224 -0.4298 0.0944 -0.3653 -0.4125 0.2735 0.1189 -0.0280 0.1048 0.1440 -0.2545 -0.2076 -0.0507 -0.1785 -0.1994 -0.1980 0.0733 -0.1663 -0.1621 0.2923 -0.1472 0.0792 0.1426 0.1276 0.1308 0.1352 0.1472 0.1463 0.1525 0.1513 0.1757 0.1414 0.1604 0.1613 0.1621
va: 1.2380 1.0564 1.9728 3.3958 2.8565 3.0346 3.7046 3.7704 3.7742 3.4260 3.4799 3.9648 3.9278 3.9440 3.9040 3.9269 3.9060 4.0617 3.9957 3.9201 3.9249 3.9135 4.0213 1.0088 1.0112 1.0005 1.0164 1.0156 1.0126 0.9977 0.9985 0.9935 1.0066 0.9899 0.9875 0.9942
dispcorr: -0.020021448 hartree
energy: -1455.251551133524
dipole: 1.73635 -3.17099 -1.43464 -1.50660 1.75427 0.24768 -7.04314 7.01874 -0.02440
magnitude: 1.45606 au
magnitude: 3.70102 debye
