program: Orca
programVersion: 5.0.2
elementType: O N C C C C C C C C C C C C C C C C C C H H H H H H H H H H H H H H H H H H H H H H H H H H H H H H H H H H H
charge: 0
multiplicity: 1
keywords: wb97x-d3
keywords: def2-TZVPP
keywords: def2/J RIJCOSX
keywords: DEFGRID2
keywords: scfconv7
keywords: smallprint printgap noloewdin
keywords: NOSOSCF
formula: C18H35NO
InChI: InChI=1/C18H35NO/c1-16-14-19(15-17(2)20-16)18-12-10-8-6-4-3-5-7-9-11-13-18/h16-18H,3-15H2,1-2H3
55 atoms
O  3.697928 -0.012891 1.088559
N  1.163676 -0.123601 -0.100993
C  -0.117889 -0.52097 -0.668088
C  -0.243543 -2.033481 -0.940035
C  -0.443604 0.322705 -1.902833
C  2.341794 -0.499615 -0.850384
C  1.337401 -0.452775 1.294333
C  3.560891 0.225615 -0.295354
C  2.548495 0.289374 1.851723
C  -1.661111 -2.576881 -1.161965
C  -0.386146 1.83442 -1.669579
C  -2.463383 -2.926448 0.096623
C  -1.260655 2.349122 -0.525393
C  -2.714105 -1.793599 1.090956
C  -2.768797 2.186294 -0.754283
C  -3.435547 -0.588335 0.491188
C  -3.597062 1.973262 0.515922
C  -3.261336 0.698838 1.2936
C  4.841992 -0.232478 -0.960859
C  2.297672 1.787592 1.974204
H  -0.852121 -0.254958 0.093531
H  0.211003 -2.586233 -0.110025
H  0.360494 -2.276786 -1.819941
H  -1.436087 0.039123 -2.263605
H  0.233407 0.064956 -2.723981
H  2.219886 -0.222199 -1.900189
H  2.533093 -1.587281 -0.822218
H  1.473687 -1.535084 1.464778
H  0.444085 -0.152459 1.850195
H  3.425806 1.300968 -0.486372
H  2.761665 -0.106124 2.849369
H  -1.580821 -3.49613 -1.747978
H  -2.232295 -1.894675 -1.797009
H  -0.669592 2.339339 -2.598562
H  0.648223 2.121198 -1.469093
H  -1.948714 -3.738067 0.620305
H  -3.424505 -3.342464 -0.221864
H  -1.037594 3.406983 -0.363618
H  -0.95024 1.855295 0.398291
H  -1.757492 -1.473874 1.515999
H  -3.284455 -2.185122 1.938112
H  -2.957309 1.360247 -1.444174
H  -3.148112 3.070846 -1.272595
H  -4.500007 -0.812941 0.370704
H  -3.062316 -0.427034 -0.520724
H  -4.657117 1.959825 0.24414
H  -3.469712 2.833879 1.179695
H  -3.873577 0.657991 2.198915
H  -2.228226 0.758171 1.652163
H  5.703253 0.294005 -0.550676
H  4.998784 -1.302166 -0.816262
H  4.808039 -0.034925 -2.03263
H  1.534671 1.976943 2.731095
H  3.205121 2.307531 2.282065
H  1.944098 2.224273 1.040797
totalener: -837.05716686 hartree
nucrepener: 1816.09433965 hartree
electener: -2653.15150651 hartree
oneelecener: -4742.16456286 hartree
twoeener: 2089.01305635 hartree
kineticenergy: 832.82802278 hartree
xcener: -85.986765694795 hartree
chargesum: -0.0000000
charge: -0.337259 -0.172852 0.234530 -0.168748 -0.230155 -0.172670 -0.151116 0.160419 0.240322 -0.163749 -0.148894 -0.146911 -0.116270 -0.114289 -0.161370 -0.117851 -0.155221 -0.124272 -0.274362 -0.323643 -0.093393 0.083471 0.082247 0.083151 0.075805 0.088429 0.074389 0.075379 0.070413 0.053843 0.072468 0.083605 0.072779 0.078683 0.073707 0.069167 0.071581 0.086611 0.046526 0.048549 0.085775 0.075368 0.082716 0.083840 0.038073 0.069525 0.073197 0.085368 0.050936 0.092674 0.079808 0.071709 0.076348 0.103220 0.078398
qa: -0.3373 -0.1729 0.2345 -0.1687 -0.2302 -0.1727 -0.1511 0.1604 0.2403 -0.1637 -0.1489 -0.1469 -0.1163 -0.1143 -0.1614 -0.1179 -0.1552 -0.1243 -0.2744 -0.3236 -0.0934 0.0835 0.0822 0.0832 0.0758 0.0884 0.0744 0.0754 0.0704 0.0538 0.0725 0.0836 0.0728 0.0787 0.0737 0.0692 0.0716 0.0866 0.0465 0.0485 0.0858 0.0754 0.0827 0.0838 0.0381 0.0695 0.0732 0.0854 0.0509 0.0927 0.0798 0.0717 0.0763 0.1032 0.0784
va: 2.0455 2.8064 3.7851 3.8998 3.9080 3.9161 4.0061 3.9593 3.9385 3.9063 3.9413 3.9233 3.8684 3.8766 3.8958 3.8408 3.9462 3.9068 3.9661 3.9336 1.0760 1.0098 1.0059 1.0130 1.0164 1.0086 1.0123 1.0201 1.0017 0.9976 0.9922 1.0056 1.0041 1.0102 1.0164 1.0109 1.0088 1.0041 1.0151 1.0112 1.0074 1.0018 1.0075 1.0098 1.0175 1.0090 1.0078 1.0066 1.0089 1.0116 1.0148 1.0057 1.0108 1.0127 1.0101
dispcorr: -0.032810303 hartree
energy: -837.089977165326
dipole: -9.81037 9.28439 -0.52598 1.10340 -1.16509 -0.06169 -2.35870 2.13959 -0.21910
magnitude: 0.57312 au
magnitude: 1.45675 debye
