program: Orca
programVersion: 5.0.2
elementType: O N C C C C C C C C C C C C C C C C C C H H H H H H H H H H H H H H H H H H H H H H H H H H H H H H H H H H H
charge: 0
multiplicity: 1
keywords: wb97x-d3
keywords: def2-TZVPP
keywords: def2/J RIJCOSX
keywords: DEFGRID2
keywords: scfconv7
keywords: smallprint printgap noloewdin
keywords: NOSOSCF
formula: C18H35NO
InChI: InChI=1/C18H35NO/c1-16-14-19(15-17(2)20-16)18-12-10-8-6-4-3-5-7-9-11-13-18/h16-18H,3-15H2,1-2H3
55 atoms
O  4.143349 -0.188747 0.826329
N  1.484755 -0.055638 -0.059877
C  0.114282 -0.35898 -0.454368
C  -0.166181 -1.84714 -0.728987
C  -0.30886 0.540141 -1.619842
C  1.78937 -0.338897 1.323797
C  2.519687 -0.600398 -0.91212
C  3.134015 0.280293 1.69527
C  3.868933 0.002461 -0.544462
C  -1.653305 -2.201343 -0.678569
C  -0.487518 2.007907 -1.233145
C  -2.251963 -2.174721 0.728508
C  -1.636991 2.273532 -0.259516
C  -3.777429 -2.066714 0.758232
C  -3.02819 1.988369 -0.827619
C  -4.332747 -0.754921 0.20086
C  -4.107565 1.795887 0.23979
C  -3.974029 0.48621 1.01906
C  3.070733 1.802063 1.758157
C  5.001864 -0.632495 -1.324257
H  -0.494216 -0.076311 0.409929
H  0.367963 -2.462062 0.003584
H  0.237946 -2.123387 -1.707899
H  -1.233213 0.157993 -2.05871
H  0.4318 0.468881 -2.421985
H  1.82397 -1.421476 1.539286
H  1.009264 0.087929 1.960128
H  2.30565 -0.363515 -1.957002
H  2.592761 -1.700102 -0.838089
H  3.418331 -0.092053 2.684029
H  3.831433 1.076151 -0.781642
H  -1.802971 -3.196492 -1.106209
H  -2.203227 -1.522942 -1.33542
H  -0.643738 2.598696 -2.141027
H  0.446383 2.364186 -0.79191
H  -1.822273 -1.352054 1.305971
H  -1.947583 -3.081674 1.258425
H  -1.595191 3.317917 0.06246
H  -1.476992 1.692161 0.652443
H  -4.122558 -2.194268 1.78887
H  -4.205492 -2.900958 0.193801
H  -3.00011 1.102696 -1.467814
H  -3.313783 2.810191 -1.490134
H  -5.421867 -0.829707 0.134785
H  -3.994212 -0.63301 -0.831319
H  -5.094856 1.833655 -0.230863
H  -4.075723 2.638856 0.936877
H  -4.612066 0.522528 1.906431
H  -2.953911 0.405599 1.403732
H  2.66475 2.236389 0.845545
H  2.427341 2.116194 2.58144
H  4.061306 2.221813 1.933158
H  5.063193 -1.703363 -1.126112
H  4.854664 -0.49236 -2.39559
H  5.958133 -0.183852 -1.056849
totalener: -837.06081639 hartree
nucrepener: 1774.54758068 hartree
electener: -2611.60839707 hartree
oneelecener: -4659.07536693 hartree
twoeener: 2047.46696986 hartree
kineticenergy: 832.83719885 hartree
xcener: -85.985083671033 hartree
chargesum: 0.0000000
charge: -0.337065 -0.162876 0.106141 -0.175348 -0.208073 -0.125496 -0.148585 0.215850 0.154864 -0.157790 -0.141102 -0.140076 -0.160483 -0.147941 -0.141072 -0.152631 -0.149148 -0.137520 -0.310897 -0.271944 -0.000827 0.076685 0.085487 0.096621 0.080238 0.072348 0.070508 0.081589 0.069600 0.071452 0.054956 0.084461 0.066741 0.072866 0.077627 0.068907 0.083278 0.083771 0.071202 0.071113 0.070697 0.061384 0.081649 0.081905 0.071606 0.071863 0.072034 0.083088 0.061097 0.078784 0.074673 0.099774 0.079749 0.070932 0.093333
qa: -0.3371 -0.1629 0.1061 -0.1753 -0.2081 -0.1255 -0.1486 0.2159 0.1549 -0.1578 -0.1411 -0.1401 -0.1605 -0.1479 -0.1411 -0.1526 -0.1491 -0.1375 -0.3109 -0.2719 -0.0008 0.0767 0.0855 0.0966 0.0802 0.0723 0.0705 0.0816 0.0696 0.0715 0.0550 0.0845 0.0667 0.0729 0.0776 0.0689 0.0833 0.0838 0.0712 0.0711 0.0707 0.0614 0.0816 0.0819 0.0716 0.0719 0.0720 0.0831 0.0611 0.0788 0.0747 0.0998 0.0797 0.0709 0.0933
va: 2.0453 2.8301 3.8828 3.9298 3.9230 3.9750 3.9073 3.9400 3.9460 3.9258 3.9160 3.8649 3.8828 3.9453 3.8731 3.8809 3.9392 3.8736 3.9379 3.9624 1.0243 1.0113 1.0032 1.0033 1.0196 1.0203 1.0030 1.0133 1.0116 0.9934 0.9993 1.0098 1.0180 1.0069 1.0257 1.0020 1.0103 1.0083 1.0000 1.0079 1.0077 1.0165 1.0110 1.0098 1.0090 1.0080 1.0080 1.0100 1.0140 1.0109 1.0114 1.0118 1.0148 1.0060 1.0113
dispcorr: -0.030889555 hartree
energy: -837.091705949171
dipole: -11.63924 11.09052 -0.54872 1.24313 -1.26590 -0.02277 -1.98277 1.83085 -0.15192
magnitude: 0.56982 au
magnitude: 1.44836 debye
