program: Orca
programVersion: 5.0.2
elementType: O N C C C C C C C C C C C C C C C C C C H H H H H H H H H H H H H H H H H H H H H H H H H H H H H H H H H H H
charge: 0
multiplicity: 1
keywords: wb97x-d3
keywords: def2-TZVPP
keywords: def2/J RIJCOSX
keywords: DEFGRID2
keywords: scfconv7
keywords: smallprint printgap noloewdin
keywords: NOSOSCF
formula: C18H35NO
InChI: InChI=1/C18H35NO/c1-16-14-19(15-17(2)20-16)18-12-10-8-6-4-3-5-7-9-11-13-18/h16-18H,3-15H2,1-2H3
55 atoms
O  -4.251518 -0.404117 0.475397
N  -1.696099 0.391619 -0.400112
C  -0.265289 0.472257 -0.67766
C  0.655025 -0.537297 0.027116
C  0.278309 1.879961 -0.376303
C  -2.383849 -0.725753 -1.012525
C  -2.065352 0.490512 0.995954
C  -3.887336 -0.535427 -0.889356
C  -3.572435 0.656904 1.127718
C  0.69817 -1.972786 -0.481072
C  1.516694 2.232926 -1.218829
C  1.885839 -2.768346 0.07407
C  2.661159 2.87748 -0.433756
C  3.254738 -2.122996 -0.194983
C  3.427542 1.908406 0.469523
C  3.792883 -1.267482 0.958566
C  4.297805 0.918093 -0.304578
C  4.843395 -0.24005 0.533782
C  -4.659405 -1.700996 -1.468089
C  -4.015227 0.670373 2.574515
H  -0.173168 0.312844 -1.759161
H  0.457616 -0.52578 1.104437
H  1.659675 -0.131772 -0.080286
H  0.522589 1.949557 0.689087
H  -0.503286 2.621202 -0.55204
H  -2.121906 -1.696897 -0.563204
H  -2.116225 -0.777068 -2.070735
H  -1.585202 1.360226 1.447568
H  -1.75542 -0.390738 1.582841
H  -4.162471 0.384057 -1.427707
H  -3.851475 1.609392 0.653303
H  0.76407 -1.963067 -1.57465
H  -0.224207 -2.504538 -0.237585
H  1.215137 2.905481 -2.025034
H  1.892329 1.338142 -1.724161
H  1.857427 -3.767419 -0.367507
H  1.755835 -2.917847 1.151395
H  2.261225 3.698521 0.169192
H  3.365347 3.337004 -1.134781
H  3.185955 -1.525505 -1.110171
H  3.992704 -2.898863 -0.414785
H  2.719334 1.376426 1.112203
H  4.067394 2.479002 1.149305
H  4.22697 -1.932366 1.710849
H  2.971851 -0.759409 1.469534
H  5.136638 1.467611 -0.742162
H  3.740571 0.515054 -1.154973
H  5.333316 0.165068 1.424854
H  5.628903 -0.751092 -0.032029
H  -4.425659 -1.817963 -2.526145
H  -4.409097 -2.635548 -0.962444
H  -5.735452 -1.544384 -1.383245
H  -3.761308 -0.265644 3.075641
H  -3.524038 1.481815 3.111417
H  -5.091675 0.822048 2.659764
elementType: O N C H
totalener: -837.06362856 hartree
nucrepener: 1746.43542813 hartree
electener: -2583.49905669 hartree
oneelecener: -4602.97839719 hartree
twoeener: 2019.47934050 hartree
cpcmener: -0.01482339 hartree
kineticenergy: 832.81551000 hartree
xcener: -85.978190741901 hartree
chargesum: 0.0000000
charge: -0.406381 -0.180618 0.120313 -0.126011 -0.188812 -0.123058 -0.110931 0.159135 0.160198 -0.131329 -0.157004 -0.169156 -0.165655 -0.115349 -0.122843 -0.156010 -0.124575 -0.171313 -0.290435 -0.287912 0.068289 0.093086 -0.058523 0.081117 0.080091 0.067792 0.097652 0.103726 0.069935 0.054496 0.053048 0.067547 0.068871 0.087860 0.069463 0.082540 0.067547 0.081095 0.072071 0.067900 0.084965 0.064014 0.080296 0.084086 0.071215 0.077022 0.066367 0.071302 0.074841 0.088377 0.085281 0.095935 0.084758 0.087935 0.095750
qa: -0.4064 -0.1806 0.1203 -0.1260 -0.1888 -0.1231 -0.1109 0.1591 0.1602 -0.1313 -0.1570 -0.1692 -0.1657 -0.1153 -0.1228 -0.1560 -0.1246 -0.1713 -0.2904 -0.2879 0.0683 0.0931 -0.0585 0.0811 0.0801 0.0678 0.0977 0.1037 0.0699 0.0545 0.0530 0.0675 0.0689 0.0879 0.0695 0.0825 0.0675 0.0811 0.0721 0.0679 0.0850 0.0640 0.0803 0.0841 0.0712 0.0770 0.0664 0.0713 0.0748 0.0884 0.0853 0.0959 0.0848 0.0879 0.0958
va: 1.9555 2.9120 3.9626 3.8026 3.8323 3.8947 3.8648 3.8889 3.9016 3.8991 3.8427 3.9309 3.9451 3.8104 3.8559 3.8682 3.8451 3.9597 3.9458 3.9421 1.0048 1.0039 1.0552 1.0037 1.0287 1.0171 1.0064 1.0014 1.0164 1.0225 1.0208 1.0066 1.0157 1.0052 1.0092 1.0054 1.0065 1.0055 1.0083 1.0091 1.0006 1.0080 1.0082 1.0069 1.0005 1.0088 1.0085 1.0080 1.0055 1.0055 1.0099 1.0083 1.0112 1.0050 1.0081
dispcorr: -0.029328366 hartree
energy: -837.092956926838
dipole: 12.50455 -11.64049 0.86406 -1.02610 1.18773 0.16163 0.73464 -0.95216 -0.21752
magnitude: 0.90556 au
magnitude: 2.30175 debye
