program: Orca
programVersion: 5.0.2
elementType: O N C C C C C C C C C C C C C C C C C C H H H H H H H H H H H H H H H H H H H H H H H H H H H H H H H H H H H
charge: 0
multiplicity: 1
keywords: wb97x-d3
keywords: def2-TZVPP
keywords: def2/J RIJCOSX
keywords: DEFGRID2
keywords: scfconv7
keywords: smallprint printgap noloewdin
keywords: NOSOSCF
formula: C18H35NO
InChI: InChI=1/C18H35NO/c1-16-14-19(15-17(2)20-16)18-12-10-8-6-4-3-5-7-9-11-13-18/h16-18H,3-15H2,1-2H3
55 atoms
O  -4.436311 0.05829 -0.028381
N  -1.611448 0.163615 -0.092075
C  -0.206598 -0.232849 0.050691
C  0.013763 -1.524516 0.860275
C  0.654052 0.925673 0.557196
C  -2.35675 -0.664928 -1.019788
C  -2.344177 0.274094 1.154942
C  -3.739666 -0.080293 -1.257239
C  -3.728096 0.853312 0.910199
C  1.473587 -1.974789 0.983804
C  0.961903 1.990011 -0.495025
C  2.245728 -2.088355 -0.329622
C  2.214334 2.816273 -0.188131
C  3.752136 -2.270115 -0.131854
C  3.479072 1.999344 0.08957
C  4.530666 -1.067793 0.421141
C  3.854374 1.009287 -1.010294
C  4.933795 0.00844 -0.595018
C  -4.572859 -0.947546 -2.174487
C  -4.54267 0.911983 2.18421
H  0.126006 -0.439228 -0.972022
H  -0.571558 -2.328137 0.40186
H  -0.380787 -1.404492 1.873409
H  1.59794 0.506698 0.903258
H  0.209191 1.385056 1.445975
H  -2.469263 -1.706795 -0.673983
H  -1.824934 -0.700783 -1.973834
H  -1.810823 0.933547 1.843095
H  -2.46354 -0.69544 1.666669
H  -3.616877 0.912428 -1.715725
H  -3.613246 1.871564 0.508572
H  1.49183 -2.948397 1.483254
H  1.999359 -1.298563 1.66225
H  0.116233 2.670367 -0.617333
H  1.087102 1.500547 -1.465726
H  2.064317 -1.217516 -0.960193
H  1.857081 -2.941543 -0.894469
H  2.022538 3.460546 0.675477
H  2.397409 3.490916 -1.030245
H  4.206187 -2.56751 -1.082417
H  3.903152 -3.11867 0.543598
H  3.367649 1.472265 1.040932
H  4.314434 2.689587 0.241902
H  5.452626 -1.455268 0.863185
H  3.987187 -0.615028 1.256395
H  4.208776 1.570612 -1.880567
H  2.971064 0.470546 -1.355109
H  5.777979 0.571354 -0.183036
H  5.32221 -0.491686 -1.487985
H  -4.714766 -1.948223 -1.762712
H  -5.554786 -0.506948 -2.351175
H  -4.080273 -1.049813 -3.141725
H  -4.671566 -0.079386 2.622248
H  -4.041391 1.541119 2.919943
H  -5.530182 1.3390 2.005252
elementType: O N C H
totalener: -837.06567651 hartree
nucrepener: 1742.19662344 hartree
electener: -2579.26229995 hartree
oneelecener: -4594.60516373 hartree
twoeener: 2015.34286378 hartree
cpcmener: -0.01552351 hartree
kineticenergy: 832.80698023 hartree
xcener: -85.979016307848 hartree
chargesum: -0.0000000
charge: -0.407180 -0.200828 0.128158 -0.208710 -0.211545 -0.125458 -0.118932 0.180565 0.153065 -0.148886 -0.137929 -0.136950 -0.171020 -0.156554 -0.132208 -0.147887 -0.147829 -0.150926 -0.290745 -0.289468 0.069869 0.088363 0.079399 0.071759 0.095758 0.067333 0.092690 0.101684 0.071049 0.053052 0.056540 0.082134 0.078103 0.067881 0.066317 0.064803 0.086426 0.071924 0.073150 0.070406 0.072872 0.073189 0.080584 0.084614 0.065722 0.085514 0.070029 0.071802 0.069057 0.085159 0.095881 0.088555 0.085259 0.088499 0.095889
qa: -0.4072 -0.2008 0.1282 -0.2087 -0.2115 -0.1255 -0.1189 0.1806 0.1531 -0.1489 -0.1379 -0.1370 -0.1710 -0.1566 -0.1322 -0.1479 -0.1478 -0.1509 -0.2907 -0.2895 0.0699 0.0884 0.0794 0.0718 0.0958 0.0673 0.0927 0.1017 0.0710 0.0531 0.0565 0.0821 0.0781 0.0679 0.0663 0.0648 0.0864 0.0719 0.0732 0.0704 0.0729 0.0732 0.0806 0.0846 0.0657 0.0855 0.0700 0.0718 0.0691 0.0852 0.0959 0.0886 0.0853 0.0885 0.0959
va: 1.9566 2.8634 3.8507 3.9663 3.8533 3.9153 3.8824 3.8515 3.9073 3.9095 3.8675 3.8584 3.9573 3.9077 3.8541 3.8919 3.8646 3.9122 3.9470 3.9473 0.9978 1.0043 1.0039 1.0054 1.0182 1.0143 1.0096 1.0067 1.0142 1.0214 1.0190 1.0081 0.9981 1.0247 1.0041 1.0067 1.0091 1.0069 1.0068 1.0091 1.0050 1.0008 1.0081 1.0024 1.0091 1.0077 1.0003 1.0049 1.0093 1.0104 1.0080 1.0052 1.0103 1.0049 1.0083
dispcorr: -0.029324241 hartree
energy: -837.095000753234
dipole: 12.33869 -11.46616 0.87253 -1.21155 1.08937 -0.12217 0.52341 -0.46944 0.05397
magnitude: 0.88269 au
magnitude: 2.24363 debye
