program: Orca
programVersion: 5.0.2
elementType: O N C C C C C C C C C C C C C C C C C C H H H H H H H H H H H H H H H H H H H H H H H H H H H H H H H H H H H
charge: 0
multiplicity: 1
keywords: wb97x-d3
keywords: def2-TZVPP
keywords: def2/J RIJCOSX
keywords: DEFGRID2
keywords: scfconv7
keywords: smallprint printgap noloewdin
keywords: NOSOSCF
formula: C18H35NO
InChI: InChI=1/C18H35NO/c1-16-14-19(15-17(2)20-16)18-12-10-8-6-4-3-5-7-9-11-13-18/h16-18H,3-15H2,1-2H3
55 atoms
O  -4.428344 0.011445 -0.203548
N  -1.623996 0.258525 0.092394
C  -0.228041 -0.098467 0.366238
C  -0.037153 -1.452748 1.087058
C  0.481818 1.057423 1.089443
C  -2.20375 -0.515226 -0.98832
C  -2.505096 0.203504 1.243657
C  -3.583529 0.015746 -1.343371
C  -3.880439 0.741429 0.883078
C  1.160812 -2.257727 0.572986
C  0.905867 2.217572 0.185734
C  2.471048 -1.489835 0.626019
C  2.088792 1.924763 -0.740477
C  3.688365 -2.168847 0.016674
C  3.440093 1.821639 -0.033019
C  4.811976 -1.156783 -0.220882
C  4.571814 1.331544 -0.938817
C  4.50715 -0.14375 -1.34509
C  -4.246839 -0.80974 -2.423871
C  -4.842774 0.646677 2.046459
H  0.22714 -0.200586 -0.6262
H  -0.929348 -2.071821 0.958685
H  0.060206 -1.290466 2.165912
H  1.353504 0.673419 1.621748
H  -0.173141 1.4415 1.876533
H  -2.286908 -1.589511 -0.747271
H  -1.563458 -0.435134 -1.870143
H  -2.102029 0.810631 2.05614
H  -2.62393 -0.820208 1.63689
H  -3.468899 1.049664 -1.702068
H  -3.771967 1.79699 0.591709
H  0.964308 -2.547373 -0.465243
H  1.241061 -3.190611 1.139409
H  1.158449 3.078956 0.812346
H  0.0510 2.533908 -0.417221
H  2.697762 -1.2092 1.660601
H  2.323765 -0.552856 0.093653
H  2.155161 2.721951 -1.487463
H  1.888817 1.013702 -1.313196
H  3.419291 -2.637607 -0.936287
H  4.038931 -2.976214 0.666036
H  3.366869 1.175607 0.846573
H  3.701535 2.8113 0.353962
H  5.73647 -1.689843 -0.453923
H  5.008569 -0.627559 0.717952
H  5.531811 1.516768 -0.447023
H  4.580219 1.945482 -1.845656
H  5.215234 -0.297736 -2.162632
H  3.525219 -0.356524 -1.779402
H  -5.231381 -0.413839 -2.675192
H  -3.643603 -0.791816 -3.331583
H  -4.363678 -1.851015 -2.118586
H  -5.825336 1.039272 1.782565
H  -4.964403 -0.384417 2.382819
H  -4.470078 1.231564 2.887415
elementType: O N C H
totalener: -837.06535073 hartree
nucrepener: 1743.21148960 hartree
electener: -2580.27684033 hartree
oneelecener: -4596.58453251 hartree
twoeener: 2016.30769218 hartree
cpcmener: -0.01498850 hartree
kineticenergy: 832.80707754 hartree
xcener: -85.976913220199 hartree
chargesum: 0.0000000
charge: -0.406099 -0.185768 0.090868 -0.189033 -0.216015 -0.115926 -0.137816 0.177185 0.168358 -0.161858 -0.162581 -0.004551 -0.133448 -0.165273 -0.125562 -0.138822 -0.165202 -0.141730 -0.288931 -0.290497 0.072440 0.083163 0.089297 0.101307 0.092756 0.070164 0.092990 0.101830 0.073391 0.053935 0.055772 0.063604 0.069835 0.076721 0.067823 0.076649 -0.059260 0.082380 0.065027 0.061888 0.070832 0.062215 0.079230 0.085379 0.065893 0.078594 0.068883 0.084715 0.067263 0.095416 0.088443 0.084800 0.095654 0.085141 0.088525
qa: -0.4061 -0.1858 0.0909 -0.1890 -0.2160 -0.1159 -0.1378 0.1772 0.1684 -0.1619 -0.1626 -0.0046 -0.1334 -0.1653 -0.1256 -0.1388 -0.1652 -0.1417 -0.2889 -0.2905 0.0724 0.0832 0.0893 0.1013 0.0928 0.0702 0.0930 0.1018 0.0734 0.0539 0.0558 0.0636 0.0698 0.0767 0.0678 0.0766 -0.0593 0.0824 0.0650 0.0619 0.0708 0.0622 0.0792 0.0854 0.0659 0.0786 0.0689 0.0847 0.0673 0.0954 0.0884 0.0848 0.0957 0.0851 0.0885
va: 1.9587 2.8429 3.7800 3.8754 3.8660 3.8826 3.8878 3.8610 3.8739 3.9387 3.9087 3.8193 3.8389 3.9573 3.8467 3.8551 3.9461 3.8275 3.9485 3.9503 0.9874 1.0128 1.0010 0.9985 1.0160 1.0176 1.0112 1.0094 1.0190 1.0198 1.0200 1.0067 1.0125 1.0064 1.0349 1.0075 1.0465 1.0067 1.0034 1.0058 1.0121 1.0102 1.0100 1.0047 1.0093 1.0051 1.0083 1.0032 1.0036 1.0082 1.0053 1.0103 1.0086 1.0100 1.0049
dispcorr: -0.029139377 hartree
energy: -837.094490108637
dipole: 12.12226 -11.30498 0.81728 -1.15358 1.11435 -0.03923 0.00436 0.09947 0.10382
magnitude: 0.82478 au
magnitude: 2.09643 debye
