program: Orca
programVersion: 5.0.2
elementType: O N C C C C C C C C C C C C C C C C C C H H H H H H H H H H H H H H H H H H H H H H H H H H H H H H H H H H H
charge: 0
multiplicity: 1
keywords: wb97x-d3
keywords: def2-TZVPP
keywords: def2/J RIJCOSX
keywords: DEFGRID2
keywords: scfconv7
keywords: smallprint printgap noloewdin
keywords: NOSOSCF
formula: C18H35NO
InChI: InChI=1/C18H35NO/c1-16-14-19(15-17(2)20-16)18-12-10-8-6-4-3-5-7-9-11-13-18/h16-18H,3-15H2,1-2H3
55 atoms
O  -4.375982 -0.160588 0.474116
N  -1.588038 0.111406 -0.104895
C  -0.354913 -0.079481 -0.886799
C  0.596391 -1.13055 -0.294394
C  0.356691 1.270552 -1.063061
C  -2.618102 0.733458 -0.923954
C  -2.148812 -1.108635 0.451996
C  -3.881349 1.021065 -0.131396
C  -3.394866 -0.803444 1.268665
C  1.177811 -0.841269 1.08728
C  1.431428 1.290996 -2.153883
C  2.156319 -1.914532 1.577251
C  2.548271 2.310629 -1.909994
C  3.466509 -2.091755 0.801194
C  3.330517 2.105012 -0.610565
C  4.610013 -1.134954 1.156072
C  3.958648 0.721082 -0.476459
C  4.353854 0.357377 0.950894
C  -4.971881 1.58324 -1.018345
C  -4.007576 -2.060131 1.846383
H  -0.625113 -0.459071 -1.889742
H  1.41362 -1.245513 -1.009992
H  0.105436 -2.107799 -0.283993
H  0.781446 1.557045 -0.099924
H  -0.368125 2.052623 -1.295122
H  -2.874518 0.096323 -1.789987
H  -2.261251 1.680886 -1.328368
H  -1.435566 -1.585083 1.123176
H  -2.403205 -1.84728 -0.328798
H  -3.637325 1.754576 0.651853
H  -3.103888 -0.136062 2.094187
H  0.370453 -0.773307 1.821753
H  1.659089 0.136965 1.094738
H  0.961353 1.511693 -3.116066
H  1.874654 0.300733 -2.278257
H  1.624884 -2.871767 1.573976
H  2.395225 -1.717366 2.627525
H  2.12334 3.319273 -1.908326
H  3.239783 2.277651 -2.757532
H  3.273561 -2.068108 -0.274648
H  3.834274 -3.103048 0.996054
H  2.665365 2.274453 0.2416
H  4.102017 2.876567 -0.532541
H  5.486517 -1.427742 0.568512
H  4.886652 -1.299391 2.202447
H  4.828508 0.638052 -1.136415
H  3.249656 -0.023856 -0.837705
H  3.570335 0.687263 1.639155
H  5.25003 0.912983 1.243759
H  -4.635461 2.505938 -1.491028
H  -5.241843 0.88004 -1.808389
H  -5.870331 1.81545 -0.445293
H  -4.2977 -2.760743 1.061314
H  -3.290986 -2.561801 2.496794
H  -4.890111 -1.83056 2.444616
elementType: O N C H
totalener: -837.06577731 hartree
nucrepener: 1747.65552919 hartree
electener: -2584.72130650 hartree
oneelecener: -4605.42650442 hartree
twoeener: 2020.70519791 hartree
cpcmener: -0.01590416 hartree
kineticenergy: 832.80799503 hartree
xcener: -85.980884514695 hartree
chargesum: 0.0000000
charge: -0.406654 -0.232707 0.123546 -0.197492 -0.218673 -0.144784 -0.127205 0.170442 0.163452 -0.165526 -0.166228 -0.165491 -0.153663 -0.151795 -0.145032 -0.158848 -0.140979 -0.132539 -0.285774 -0.288125 0.078104 0.105763 0.093692 0.083635 0.099920 0.072173 0.107237 0.101820 0.082192 0.052993 0.051937 0.090838 0.069648 0.086242 0.077459 0.078056 0.077876 0.072059 0.073031 0.070927 0.084437 0.065704 0.082365 0.070084 0.071334 0.086062 0.051783 0.065416 0.082552 0.088370 0.084480 0.096405 0.084949 0.088556 0.095979
qa: -0.4067 -0.2327 0.1235 -0.1975 -0.2187 -0.1448 -0.1272 0.1704 0.1635 -0.1655 -0.1662 -0.1655 -0.1537 -0.1518 -0.1450 -0.1588 -0.1410 -0.1325 -0.2858 -0.2881 0.0781 0.1058 0.0937 0.0836 0.0999 0.0722 0.1072 0.1018 0.0822 0.0530 0.0519 0.0908 0.0696 0.0862 0.0775 0.0781 0.0779 0.0721 0.0730 0.0709 0.0844 0.0657 0.0824 0.0701 0.0713 0.0861 0.0518 0.0654 0.0826 0.0884 0.0845 0.0964 0.0849 0.0886 0.0960
va: 1.9600 2.8710 3.8523 3.8471 3.8622 3.9091 3.8591 3.8801 3.9194 3.8829 3.8881 3.9000 3.9408 3.8594 3.8974 3.9269 3.8377 3.8743 3.9433 3.9445 1.0068 1.0021 1.0046 1.0095 1.0132 1.0242 1.0068 0.9975 1.0178 1.0182 1.0206 1.0116 1.0089 1.0061 1.0033 1.0064 1.0064 1.0080 1.0067 1.0030 1.0039 1.0052 1.0089 1.0078 1.0087 1.0111 1.0079 1.0044 1.0067 1.0054 1.0110 1.0078 1.0103 1.0049 1.0081
dispcorr: -0.029376359 hartree
energy: -837.095153668694
dipole: 11.89979 -11.11536 0.78443 -0.64765 0.60337 -0.04429 -0.84558 0.57118 -0.27440
magnitude: 0.83222 au
magnitude: 2.11533 debye
