program: Orca
programVersion: 5.0.2
elementType: O N C C C C C C C C C C C C C C C C C C H H H H H H H H H H H H H H H H H H H H H H H H H H H H H H H H H H H
charge: 0
multiplicity: 1
keywords: wb97x-d3
keywords: def2-TZVPP
keywords: def2/J RIJCOSX
keywords: DEFGRID2
keywords: scfconv7
keywords: smallprint printgap noloewdin
keywords: NOSOSCF
formula: C18H35NO
InChI: InChI=1/C18H35NO/c1-16-14-19(15-17(2)20-16)18-12-10-8-6-4-3-5-7-9-11-13-18/h16-18H,3-15H2,1-2H3
55 atoms
O  -4.521327 0.260291 0.471236
N  -1.92773 -0.20703 -0.527776
C  -0.476011 -0.156992 -0.720487
C  0.016752 -1.567516 -1.081958
C  0.279375 0.538283 0.432007
C  -2.362648 -0.787487 0.726901
C  -2.594119 1.059947 -0.74239
C  -3.872306 -0.973319 0.721523
C  -4.103102 0.863449 -0.739798
C  1.477821 -1.715962 -1.533145
C  1.539067 1.255669 -0.032312
C  2.427713 -2.148789 -0.415447
C  2.341504 1.968779 1.053155
C  3.915489 -2.042871 -0.76068
C  3.759825 2.317211 0.573287
C  4.509308 -0.635697 -0.6404
C  4.850776 1.335522 1.017455
C  4.564907 -0.149418 0.806754
C  -4.380889 -1.505862 2.043249
C  -4.849645 2.170306 -0.892671
H  -0.329281 0.457942 -1.617124
H  -0.637912 -1.914931 -1.884557
H  -0.157009 -2.2489 -0.2421
H  0.531307 -0.185944 1.213954
H  -0.381975 1.271749 0.906098
H  -2.089116 -0.168426 1.598971
H  -1.896245 -1.76418 0.869786
H  -2.295681 1.462197 -1.714087
H  -2.333237 1.819516 0.016136
H  -4.124346 -1.686366 -0.079084
H  -4.357063 0.200862 -1.58203
H  1.825122 -0.794783 -2.009558
H  1.52355 -2.475017 -2.319394
H  1.269505 1.98711 -0.802417
H  2.190294 0.544218 -0.530971
H  2.193152 -3.187495 -0.162921
H  2.214887 -1.584063 0.496014
H  2.394083 1.348035 1.954162
H  1.810945 2.876514 1.354088
H  4.074535 -2.420563 -1.776162
H  4.482801 -2.710928 -0.104347
H  4.046294 3.30739 0.936918
H  3.754677 2.402364 -0.518305
H  3.946577 0.060871 -1.268262
H  5.523063 -0.640148 -1.052703
H  5.026643 1.488143 2.087078
H  5.789527 1.604515 0.521655
H  3.633212 -0.397353 1.322567
H  5.337157 -0.724681 1.32768
H  -3.931325 -2.475891 2.25802
H  -4.135697 -0.832197 2.866621
H  -5.463204 -1.641406 2.025033
H  -4.582481 2.649978 -1.834878
H  -5.928729 2.010452 -0.900109
H  -4.612838 2.863647 -0.083479
elementType: O N C H
totalener: -837.07593527 hartree
nucrepener: 1725.39560572 hartree
electener: -2562.47154098 hartree
oneelecener: -4560.90468252 hartree
twoeener: 1998.43314154 hartree
cpcmener: -0.01232896 hartree
kineticenergy: 832.79845712 hartree
xcener: -85.973405611923 hartree
chargesum: -0.0000000
charge: -0.385598 -0.188013 0.099241 -0.189092 -0.192340 -0.125875 -0.124689 0.158455 0.177719 -0.122785 -0.153348 -0.154696 -0.117434 -0.165091 -0.148155 -0.134557 -0.174265 -0.121818 -0.285398 -0.288275 0.060346 0.074455 0.069254 0.084534 0.087911 0.071821 0.103390 0.090948 0.066545 0.053001 0.050320 0.069344 0.087021 0.084238 0.017353 0.080803 0.069737 0.062449 0.084183 0.074140 0.075950 0.079506 0.068967 0.068232 0.081948 0.076216 0.065760 0.065730 0.081568 0.086147 0.084159 0.094855 0.086205 0.094933 0.084043
qa: -0.3856 -0.1880 0.0992 -0.1891 -0.1923 -0.1259 -0.1247 0.1585 0.1777 -0.1228 -0.1533 -0.1547 -0.1174 -0.1651 -0.1482 -0.1346 -0.1743 -0.1218 -0.2854 -0.2883 0.0603 0.0745 0.0693 0.0845 0.0879 0.0718 0.1034 0.0909 0.0665 0.0530 0.0503 0.0693 0.0870 0.0842 0.0174 0.0808 0.0697 0.0624 0.0842 0.0741 0.0760 0.0795 0.0690 0.0682 0.0819 0.0762 0.0658 0.0657 0.0816 0.0861 0.0842 0.0949 0.0862 0.0949 0.0840
va: 1.9795 2.8702 3.9145 3.9139 3.8569 3.8627 3.9176 3.9059 3.8512 3.8503 3.9156 3.8587 3.8436 3.9458 3.8629 3.8752 3.9495 3.8382 3.9462 3.9486 1.0068 1.0296 1.0107 0.9991 1.0068 1.0189 1.0033 1.0104 1.0175 1.0204 1.0211 1.0045 1.0013 1.0137 1.0123 1.0089 1.0068 1.0114 1.0068 1.0074 1.0060 1.0071 1.0038 0.9973 1.0078 1.0043 1.0099 1.0089 1.0074 1.0055 1.0106 1.0088 1.0055 1.0085 1.0106
dispcorr: -0.028756381 hartree
energy: -837.104691648893
dipole: 13.38506 -12.58986 0.79520 0.51219 -0.58891 -0.07672 1.29018 -1.49750 -0.20732
magnitude: 0.82536 au
magnitude: 2.09789 debye
