program: Orca
programVersion: 5.0.2
elementType: O N C C C C C C C C C C C C C C C C C C H H H H H H H H H H H H H H H H H H H H H H H H H H H H H H H H H H H
charge: 0
multiplicity: 1
keywords: wb97x-d3
keywords: def2-TZVPP
keywords: def2/J RIJCOSX
keywords: DEFGRID2
keywords: scfconv7
keywords: smallprint printgap noloewdin
keywords: NOSOSCF
formula: C18H35NO
InChI: InChI=1/C18H35NO/c1-16-14-19(15-17(2)20-16)18-12-10-8-6-4-3-5-7-9-11-13-18/h16-18H,3-15H2,1-2H3
55 atoms
O  -4.546496 0.289057 0.398991
N  -1.933936 -0.209938 -0.536337
C  -0.476269 -0.174954 -0.67143
C  0.046044 -1.596678 -0.929197
C  0.250764 0.589692 0.464275
C  -2.431506 -0.842812 0.668262
C  -2.556696 1.085738 -0.710039
C  -3.945424 -0.977455 0.598533
C  -4.070371 0.940732 -0.764284
C  1.48586 -1.719883 -1.444379
C  1.217573 1.647899 -0.071538
C  2.540652 -1.655149 -0.349253
C  2.184244 2.237971 0.959086
C  3.993807 -1.76538 -0.801073
C  3.392632 1.358813 1.29754
C  4.963212 -1.351649 0.317183
C  4.337508 1.172089 0.110847
C  5.424256 0.109802 0.266044
C  -4.521952 -1.57206 1.864447
C  -4.768025 2.279436 -0.86921
H  -0.301538 0.382847 -1.60023
H  -0.625852 -2.041888 -1.667319
H  -0.049342 -2.207524 -0.025387
H  0.762361 -0.10821 1.131835
H  -0.480865 1.098908 1.099363
H  -2.168134 -0.284813 1.584068
H  -2.004132 -1.841887 0.769406
H  -2.212709 1.523919 -1.650911
H  -2.297989 1.799947 0.092012
H  -4.187202 -1.632737 -0.253041
H  -4.319498 0.333174 -1.648493
H  1.679244 -0.94691 -2.19691
H  1.580325 -2.674539 -1.971583
H  0.618419 2.457381 -0.500447
H  1.780893 1.239064 -0.915241
H  2.341299 -2.444351 0.384624
H  2.426135 -0.723356 0.193652
H  1.63346 2.4685 1.876889
H  2.554899 3.198513 0.586484
H  4.161024 -1.143037 -1.687435
H  4.199744 -2.791628 -1.118363
H  3.053706 0.394102 1.685516
H  3.946474 1.821705 2.120202
H  5.860307 -1.975179 0.283647
H  4.499689 -1.565797 1.285798
H  4.823584 2.132724 -0.088876
H  3.766277 0.95098 -0.794967
H  6.021046 0.321815 1.159449
H  6.110544 0.216128 -0.580353
H  -4.290594 -0.957524 2.736722
H  -5.606286 -1.671428 1.795881
H  -4.110582 -2.567232 2.036102
H  -5.850979 2.157755 -0.920841
H  -4.536904 2.919474 -0.015544
H  -4.452854 2.799691 -1.774303
elementType: O N C H
totalener: -837.07614579 hartree
nucrepener: 1726.76719147 hartree
electener: -2563.84333726 hartree
oneelecener: -4563.63004497 hartree
twoeener: 1999.78670771 hartree
cpcmener: -0.01222714 hartree
kineticenergy: 832.79365720 hartree
xcener: -85.972642165995 hartree
chargesum: -0.0000000
charge: -0.385883 -0.170019 0.057079 -0.147798 -0.197775 -0.136232 -0.115614 0.170494 0.170492 -0.143072 -0.151465 -0.095736 -0.172968 -0.128908 -0.126421 -0.146904 -0.120197 -0.170995 -0.286313 -0.287908 0.058352 0.076022 0.065843 0.091687 0.091787 0.071126 0.098919 0.093288 0.067666 0.051158 0.051249 0.060673 0.078012 0.090592 0.078225 0.078134 -0.026066 0.075516 0.077980 0.061416 0.080634 0.066713 0.082419 0.080167 0.068887 0.081653 0.060753 0.066057 0.076002 0.084193 0.095090 0.086265 0.095172 0.084105 0.086454
qa: -0.3859 -0.1700 0.0571 -0.1478 -0.1978 -0.1362 -0.1156 0.1705 0.1705 -0.1431 -0.1515 -0.0957 -0.1730 -0.1289 -0.1264 -0.1469 -0.1202 -0.1710 -0.2863 -0.2879 0.0584 0.0760 0.0658 0.0917 0.0918 0.0711 0.0989 0.0933 0.0677 0.0512 0.0512 0.0607 0.0780 0.0906 0.0782 0.0781 -0.0261 0.0755 0.0780 0.0614 0.0806 0.0667 0.0824 0.0802 0.0689 0.0817 0.0608 0.0661 0.0760 0.0842 0.0951 0.0863 0.0952 0.0841 0.0865
va: 1.9791 2.8864 3.9459 3.8869 3.7738 3.8839 3.8969 3.8813 3.8657 3.9266 3.8447 3.8823 3.9545 3.8622 3.8700 3.8625 3.8319 3.9441 3.9471 3.9476 1.0078 1.0299 1.0128 0.9983 1.0026 1.0197 1.0067 1.0084 1.0172 1.0205 1.0203 1.0102 1.0077 1.0057 1.0044 1.0167 1.0159 1.0070 1.0063 1.0102 1.0076 0.9970 1.0068 1.0060 1.0041 1.0065 1.0116 1.0100 1.0045 1.0105 1.0085 1.0054 1.0085 1.0106 1.0054
dispcorr: -0.028886245 hartree
energy: -837.105032030530
dipole: 13.42075 -12.65797 0.76279 0.65837 -0.68571 -0.02734 1.38281 -1.53843 -0.15563
magnitude: 0.77898 au
magnitude: 1.98001 debye
