program: Orca
programVersion: 5.0.2
elementType: O N C C C C C C C C C C C C C C C C C C H H H H H H H H H H H H H H H H H H H H H H H H H H H H H H H H H H H
charge: 0
multiplicity: 1
keywords: wb97x-d3
keywords: def2-TZVPP
keywords: def2/J RIJCOSX
keywords: DEFGRID2
keywords: scfconv7
keywords: smallprint printgap noloewdin
keywords: NOSOSCF
formula: C18H35NO
InChI: InChI=1/C18H35NO/c1-16-14-19(15-17(2)20-16)18-12-10-8-6-4-3-5-7-9-11-13-18/h16-18H,3-15H2,1-2H3
55 atoms
O  -4.42195 -0.231648 0.344889
N  -1.602056 0.053145 -0.015784
C  -0.332252 -0.021165 -0.749728
C  0.596414 -1.12534 -0.221279
C  0.40764 1.325263 -0.724675
C  -2.563062 0.908885 -0.693995
C  -2.2305 -1.243027 0.183141
C  -3.85126 1.038657 0.101567
C  -3.515829 -1.107342 0.985391
C  0.983326 -1.048317 1.253616
C  1.496336 1.448876 -1.794991
C  2.055681 -2.064489 1.647985
C  2.622698 2.42674 -1.415265
C  3.430801 -1.946895 0.984246
C  4.034251 1.85707 -1.580421
C  4.28116 -0.73328 1.378852
C  4.304215 0.545259 -0.840694
C  4.006791 0.585916 0.653773
C  -4.874597 1.87689 -0.633277
C  -4.206768 -2.440409 1.171325
H  -0.539648 -0.27328 -1.80788
H  1.501463 -1.092123 -0.831862
H  0.167577 -2.110089 -0.428717
H  0.848948 1.461683 0.265598
H  -0.282436 2.161791 -0.844535
H  -2.795029 0.528284 -1.706164
H  -2.158043 1.912725 -0.818933
H  -1.571947 -1.903084 0.746449
H  -2.451832 -1.746618 -0.775972
H  -3.611575 1.520209 1.062842
H  -3.251952 -0.698305 1.973972
H  0.10346 -1.228895 1.877806
H  1.317552 -0.043146 1.514387
H  1.038125 1.752828 -2.739844
H  1.924424 0.465443 -1.997654
H  1.667904 -3.068641 1.443043
H  2.193412 -2.019446 2.733515
H  2.492819 2.751104 -0.378815
H  2.5471 3.340661 -2.010067
H  3.335177 -2.008257 -0.103518
H  3.990432 -2.843814 1.265908
H  4.751425 2.613332 -1.244544
H  4.23993 1.702402 -2.644579
H  5.334171 -0.988238 1.218057
H  4.181345 -0.572507 2.457862
H  5.354792 0.272686 -0.98791
H  3.729554 -0.258845 -1.308264
H  2.974075 0.896619 0.821361
H  4.624582 1.365124 1.114025
H  -4.485522 2.879814 -0.81136
H  -5.130023 1.438807 -1.600285
H  -5.792605 1.978678 -0.052751
H  -5.122588 -2.330371 1.753831
H  -4.464795 -2.893682 0.212201
H  -3.557515 -3.133522 1.70738
elementType: O N C H
totalener: -837.07532643 hartree
nucrepener: 1743.98948179 hartree
electener: -2581.06480822 hartree
oneelecener: -4598.07299842 hartree
twoeener: 2017.00819020 hartree
cpcmener: -0.01330526 hartree
kineticenergy: 832.79239485 hartree
xcener: -85.975067042779 hartree
chargesum: -0.0000000
charge: -0.385262 -0.222334 0.109046 -0.181034 -0.230074 -0.148090 -0.128573 0.169400 0.159490 -0.174156 -0.176611 -0.164626 -0.142630 -0.157942 -0.178536 -0.155463 -0.117058 -0.131615 -0.284839 -0.283902 0.079501 0.096027 0.096355 0.083359 0.100592 0.072100 0.104007 0.097546 0.083801 0.051359 0.051117 0.084047 0.090082 0.092533 0.082410 0.073528 0.071754 0.067263 0.083534 0.073693 0.085481 0.070423 0.076081 0.074515 0.071475 0.077409 0.063688 0.056951 0.083675 0.086153 0.084093 0.095297 0.094895 0.083871 0.086194
qa: -0.3853 -0.2223 0.1090 -0.1810 -0.2301 -0.1481 -0.1286 0.1694 0.1595 -0.1742 -0.1766 -0.1646 -0.1426 -0.1579 -0.1785 -0.1555 -0.1171 -0.1316 -0.2848 -0.2839 0.0795 0.0960 0.0964 0.0834 0.1006 0.0721 0.1040 0.0975 0.0838 0.0514 0.0511 0.0840 0.0901 0.0925 0.0824 0.0735 0.0718 0.0673 0.0835 0.0737 0.0855 0.0704 0.0761 0.0745 0.0715 0.0774 0.0637 0.0570 0.0837 0.0862 0.0841 0.0953 0.0949 0.0839 0.0862
va: 1.9826 2.8688 3.8381 3.8486 3.8808 3.9121 3.8532 3.8833 3.9354 3.8630 3.8603 3.9162 3.8649 3.8720 3.9355 3.9213 3.8445 3.8708 3.9457 3.9435 1.0104 1.0075 1.0036 1.0080 1.0157 1.0235 1.0105 0.9987 1.0200 1.0185 1.0189 1.0123 1.0022 1.0062 1.0061 1.0079 1.0084 1.0030 1.0077 1.0019 1.0038 1.0091 1.0052 1.0054 1.0084 1.0121 1.0127 1.0112 1.0090 1.0057 1.0105 1.0083 1.0086 1.0106 1.0053
dispcorr: -0.029285362 hartree
energy: -837.104611791461
dipole: 12.23780 -11.48831 0.74949 -0.19464 0.20434 0.00970 -0.95979 0.76796 -0.19183
magnitude: 0.77371 au
magnitude: 1.96662 debye
