program: Orca
programVersion: 5.0.2
elementType: O N C C C C C C C C C C C C C C C C C C H H H H H H H H H H H H H H H H H H H H H H H H H H H H H H H H H H H
charge: 0
multiplicity: 1
keywords: wb97x-d3
keywords: def2-TZVPP
keywords: def2/J RIJCOSX
keywords: DEFGRID2
keywords: scfconv7
keywords: smallprint printgap noloewdin
keywords: NOSOSCF
formula: C18H35NO
InChI: InChI=1/C18H35NO/c1-16-14-19(15-17(2)20-16)18-12-10-8-6-4-3-5-7-9-11-13-18/h16-18H,3-15H2,1-2H3
55 atoms
O  -4.290912 -0.155317 -0.132843
N  -1.513286 0.29427 0.035844
C  -0.093817 0.10342 0.329396
C  0.226204 -1.011944 1.338689
C  0.556453 1.436621 0.714993
C  -2.058833 -0.691596 -0.873041
C  -2.365655 0.420777 1.200394
C  -3.473583 -0.307225 -1.278067
C  -3.778816 0.796495 0.781582
C  1.68247 -1.481683 1.282331
C  0.893691 2.31969 -0.496482
C  2.039572 -2.303052 0.043312
C  2.270351 2.990408 -0.434514
C  3.535141 -2.622044 -0.090777
C  3.43293 2.053165 -0.092812
C  4.399929 -1.654574 -0.906872
C  3.454665 0.739889 -0.867077
C  4.537629 -0.221543 -0.380154
C  -4.113009 -1.347909 -2.171218
C  -4.719624 0.854583 1.965209
H  0.349704 -0.197227 -0.625616
H  -0.426799 -1.873707 1.160788
H  0.002584 -0.667321 2.353392
H  1.463579 1.229427 1.282963
H  -0.08711 1.977325 1.413842
H  -2.075798 -1.709845 -0.445028
H  -1.436746 -0.732186 -1.770756
H  -1.983269 1.202209 1.860425
H  -2.414382 -0.50763 1.794183
H  -3.420105 0.652227 -1.816278
H  -3.74047 1.784506 0.29668
H  1.887549 -2.096383 2.164269
H  2.352693 -0.622448 1.371905
H  0.1344 3.093829 -0.630057
H  0.844933 1.714646 -1.406491
H  1.689787 -1.811626 -0.869533
H  1.480541 -3.242528 0.096838
H  2.25518 3.800436 0.301252
H  2.458888 3.470021 -1.399821
H  3.638322 -3.604607 -0.559262
H  3.969935 -2.732499 0.909037
H  3.410976 1.82195 0.977009
H  4.37505 2.588233 -0.25013
H  4.032639 -1.62701 -1.938581
H  5.396529 -2.100253 -0.965934
H  3.595735 0.935443 -1.935777
H  2.482104 0.253232 -0.787119
H  4.549532 -0.237808 0.715291
H  5.513134 0.177093 -0.675192
H  -4.179514 -2.315496 -1.67001
H  -5.119157 -1.048868 -2.468515
H  -3.525942 -1.480004 -3.08043
H  -5.727308 1.137137 1.65751
H  -4.777305 -0.109658 2.474129
H  -4.375518 1.595278 2.687656
elementType: O N C H
totalener: -837.07663150 hartree
nucrepener: 1750.41366974 hartree
electener: -2587.49030123 hartree
oneelecener: -4610.96765474 hartree
twoeener: 2023.47735351 hartree
cpcmener: -0.01263550 hartree
kineticenergy: 832.80642539 hartree
xcener: -85.975341567771 hartree
chargesum: 0.0000000
charge: -0.384191 -0.193029 0.099691 -0.179950 -0.224546 -0.116495 -0.127423 0.175556 0.158001 -0.174407 -0.139381 -0.103278 -0.178278 -0.157447 -0.115052 -0.147642 -0.121271 -0.135587 -0.286857 -0.287095 0.071852 0.078084 0.090925 0.102800 0.095505 0.064833 0.090026 0.097608 0.068956 0.050912 0.054693 0.082679 0.063144 0.077773 0.061638 0.066402 0.081080 0.072694 0.073792 0.080727 0.059979 0.063663 0.076480 0.061032 0.079965 0.082821 0.014777 0.062053 0.083672 0.083658 0.094277 0.086101 0.094829 0.083598 0.085656
qa: -0.3842 -0.1930 0.0997 -0.1799 -0.2245 -0.1165 -0.1274 0.1756 0.1580 -0.1744 -0.1394 -0.1033 -0.1783 -0.1574 -0.1151 -0.1476 -0.1213 -0.1356 -0.2869 -0.2871 0.0719 0.0781 0.0909 0.1028 0.0955 0.0648 0.0900 0.0976 0.0690 0.0509 0.0547 0.0827 0.0631 0.0778 0.0616 0.0664 0.0811 0.0727 0.0738 0.0807 0.0600 0.0637 0.0765 0.0610 0.0800 0.0828 0.0148 0.0621 0.0837 0.0837 0.0943 0.0861 0.0948 0.0836 0.0857
va: 1.9799 2.8418 3.8328 3.9304 3.8570 3.9041 3.8932 3.8721 3.9030 3.9357 3.8630 3.8103 3.9580 3.9217 3.8709 3.9108 3.8732 3.8640 3.9475 3.9497 0.9839 1.0102 1.0013 0.9992 1.0156 1.0166 1.0102 1.0071 1.0146 1.0205 1.0195 1.0111 1.0141 1.0122 1.0080 1.0055 1.0045 1.0061 1.0067 1.0030 1.0096 1.0055 1.0114 1.0087 1.0043 1.0119 1.0126 1.0067 1.0042 1.0110 1.0087 1.0057 1.0087 1.0108 1.0055
dispcorr: -0.029405234 hartree
energy: -837.106036729263
dipole: 11.74077 -10.96146 0.77931 -1.34840 1.32126 -0.02714 0.27941 -0.17208 0.10733
magnitude: 0.78713 au
magnitude: 2.00074 debye
