program: Orca
programVersion: 5.0.2
elementType: O N C C C C C C C C C C C C C C C C C C H H H H H H H H H H H H H H H H H H H H H H H H H H H H H H H H H H H
charge: 0
multiplicity: 1
keywords: wb97x-d3
keywords: def2-TZVPP
keywords: def2/J RIJCOSX
keywords: DEFGRID2
keywords: scfconv7
keywords: smallprint printgap noloewdin
keywords: NOSOSCF
formula: C18H35NO
InChI: InChI=1/C18H35NO/c1-16-14-19(15-17(2)20-16)18-12-10-8-6-4-3-5-7-9-11-13-18/h16-18H,3-15H2,1-2H3
55 atoms
O  -4.615491 -0.04386 0.107954
N  -1.821431 0.149241 -0.144624
C  -0.381938 -0.103924 -0.082022
C  -0.008802 -1.333697 0.768396
C  0.382562 1.161134 0.352778
C  -2.56964 -0.833645 -0.897835
C  -2.470733 0.407442 1.123736
C  -3.989517 -0.338281 -1.127939
C  -3.894056 0.893301 0.887965
C  1.480435 -1.670295 0.849272
C  1.637394 1.376666 -0.48861
C  2.103924 -2.176608 -0.452723
C  2.630012 2.405711 0.043177
C  3.637129 -2.250873 -0.471193
C  3.998568 2.304116 -0.646302
C  4.371849 -0.935037 -0.765438
C  5.019012 1.415398 0.075373
C  4.56968 -0.001479 0.429397
C  -4.838869 -1.362685 -1.84797
C  -4.647875 1.090406 2.185139
H  -0.095551 -0.312032 -1.11985
H  -0.551202 -2.20897 0.394674
H  -0.366858 -1.170836 1.78984
H  0.654527 1.099147 1.412556
H  -0.271101 2.03278 0.256839
H  -2.615039 -1.819687 -0.402936
H  -2.087785 -0.984858 -1.867737
H  -1.925676 1.182434 1.668641
H  -2.508523 -0.481012 1.77789
H  -3.933581 0.578808 -1.735102
H  -3.840638 1.852274 0.34882
H  1.616301 -2.442374 1.61334
H  2.018137 -0.801125 1.228533
H  1.339824 1.659214 -1.504635
H  2.151345 0.425543 -0.601736
H  1.775973 -1.569292 -1.30232
H  1.702977 -3.176914 -0.645509
H  2.754048 2.280113 1.125078
H  2.217188 3.409868 -0.090146
H  3.921757 -2.96809 -1.246113
H  4.000939 -2.679037 0.470296
H  4.443073 3.298966 -0.735652
H  3.857254 1.958676 -1.675999
H  3.84878 -0.418479 -1.576591
H  5.361615 -1.170288 -1.16961
H  5.303848 1.918363 1.005203
H  5.932345 1.368784 -0.527671
H  3.664377 0.061198 1.034834
H  5.319674 -0.447847 1.090365
H  -4.4032 -1.598302 -2.819707
H  -4.913223 -2.291819 -1.279274
H  -5.848889 -0.988758 -2.022649
H  -4.714792 0.160681 2.753749
H  -4.143088 1.829258 2.808518
H  -5.661366 1.451266 2.003588
elementType: O N C H
totalener: -837.07550846 hartree
nucrepener: 1726.63978058 hartree
electener: -2563.71528904 hartree
oneelecener: -4563.42052266 hartree
twoeener: 1999.70523362 hartree
cpcmener: -0.01205309 hartree
kineticenergy: 832.78839914 hartree
xcener: -85.972368493841 hartree
chargesum: 0.0000000
charge: -0.384364 -0.169058 0.095056 -0.212726 -0.200223 -0.126147 -0.118306 0.176746 0.153243 -0.137192 -0.112645 -0.114753 -0.125217 -0.177345 -0.152371 -0.117330 -0.167869 -0.118233 -0.287080 -0.285325 0.066640 0.080473 0.084925 0.074027 0.076675 0.066986 0.092730 0.100974 0.069581 0.049061 0.051458 0.083665 0.067735 0.084700 -0.005212 0.065320 0.079370 0.060691 0.082294 0.084170 0.063095 0.080672 0.068299 0.061594 0.079602 0.074728 0.066173 0.060004 0.081448 0.085915 0.083828 0.095152 0.083766 0.086124 0.094477
qa: -0.3844 -0.1691 0.0951 -0.2127 -0.2002 -0.1261 -0.1183 0.1767 0.1532 -0.1372 -0.1126 -0.1148 -0.1252 -0.1773 -0.1524 -0.1173 -0.1679 -0.1182 -0.2871 -0.2853 0.0666 0.0805 0.0849 0.0740 0.0767 0.0670 0.0927 0.1010 0.0696 0.0491 0.0515 0.0837 0.0677 0.0847 -0.0052 0.0653 0.0794 0.0607 0.0823 0.0842 0.0631 0.0807 0.0683 0.0616 0.0796 0.0747 0.0662 0.0600 0.0814 0.0859 0.0838 0.0952 0.0838 0.0861 0.0945
va: 1.9799 2.9074 3.8910 3.9543 3.9005 3.9211 3.8622 3.8588 3.9189 3.8967 3.9111 3.8509 3.8794 3.9511 3.8797 3.8664 3.9437 3.8307 3.9457 3.9454 0.9977 1.0066 1.0051 1.0020 1.0267 1.0135 1.0085 1.0038 1.0156 1.0221 1.0200 1.0061 1.0095 1.0153 1.0040 1.0052 1.0059 1.0108 1.0056 1.0017 1.0083 1.0064 1.0035 1.0033 1.0033 1.0056 1.0104 1.0139 1.0072 1.0057 1.0109 1.0085 1.0109 1.0054 1.0090
dispcorr: -0.028832240 hartree
energy: -837.104340703359
dipole: 13.15440 -12.31332 0.84109 -1.01835 0.95156 -0.06679 0.50355 -0.53285 -0.02930
magnitude: 0.84424 au
magnitude: 2.14589 debye
