program: Orca
programVersion: 5.0.2
elementType: O N C C C C C C C C C C C C C C C C C C H H H H H H H H H H H H H H H H H H H H H H H H H H H H H H H H H H H
charge: 0
multiplicity: 1
keywords: wb97x-d3
keywords: def2-TZVPP
keywords: def2/J RIJCOSX
keywords: DEFGRID2
keywords: scfconv7
keywords: smallprint printgap noloewdin
keywords: NOSOSCF
formula: C18H35NO
InChI: InChI=1/C18H35NO/c1-16-14-19(15-17(2)20-16)18-12-10-8-6-4-3-5-7-9-11-13-18/h16-18H,3-15H2,1-2H3
55 atoms
O  -4.40604 0.063664 -0.220049
N  -1.60917 0.201065 0.119047
C  -0.2163 -0.1556 0.389764
C  -0.017164 -1.505301 1.115982
C  0.486654 1.01278 1.098831
C  -2.196811 -0.527669 -0.985714
C  -2.49993 0.160697 1.260845
C  -3.548046 0.07258 -1.345364
C  -3.85427 0.748743 0.889361
C  1.201835 -2.296195 0.624731
C  0.855776 2.172916 0.172137
C  2.496374 -1.498625 0.660436
C  2.030556 1.901187 -0.771395
C  3.731183 -2.159783 0.065508
C  3.39573 1.839767 -0.084207
C  4.821998 -1.118399 -0.202331
C  4.523856 1.342332 -0.991481
C  4.482321 -0.146147 -1.352445
C  -4.23348 -0.683267 -2.462533
C  -4.843196 0.656724 2.030871
H  0.236399 -0.262161 -0.60357
H  -0.899305 -2.134874 0.968498
H  0.056017 -1.343219 2.196735
H  1.378563 0.652214 1.612106
H  -0.158633 1.385049 1.899233
H  -2.330245 -1.602806 -0.767959
H  -1.537666 -0.455946 -1.854557
H  -2.087426 0.749019 2.081889
H  -2.653285 -0.862597 1.643346
H  -3.377901 1.113356 -1.663742
H  -3.701929 1.806546 0.623984
H  1.015407 -2.618715 -0.405688
H  1.300679 -3.212063 1.215733
H  1.089127 3.054827 0.77741
H  -0.025326 2.442753 -0.417397
H  2.716794 -1.1914 1.688234
H  2.328846 -0.577351 0.107701
H  2.063638 2.690912 -1.528854
H  1.844086 0.979021 -1.331142
H  3.475676 -2.663792 -0.873133
H  4.108651 -2.937112 0.736282
H  3.347035 1.219219 0.815557
H  3.646939 2.844615 0.27027
H  5.763555 -1.626846 -0.422688
H  5.003288 -0.558678 0.721997
H  5.486928 1.560212 -0.518914
H  4.509991 1.928878 -1.916458
H  5.182046 -0.311637 -2.175379
H  3.499361 -0.39023 -1.767925
H  -5.19122 -0.22702 -2.717133
H  -3.615258 -0.674545 -3.360495
H  -4.414309 -1.724581 -2.187908
H  -5.802604 1.100104 1.760574
H  -5.017921 -0.381088 2.322516
H  -4.46697 1.191812 2.903239
elementType: O N C H
totalener: -837.07791208 hartree
nucrepener: 1744.34427923 hartree
electener: -2581.42219131 hartree
oneelecener: -4598.82176910 hartree
twoeener: 2017.39957779 hartree
cpcmener: -0.01211034 hartree
kineticenergy: 832.79503840 hartree
xcener: -85.974162941543 hartree
chargesum: 0.0000000
charge: -0.384445 -0.179375 0.088408 -0.188577 -0.208392 -0.110134 -0.135996 0.171514 0.163045 -0.160762 -0.162585 -0.006863 -0.135569 -0.163856 -0.125075 -0.137563 -0.164948 -0.141059 -0.287859 -0.288131 0.069136 0.081368 0.088571 0.100543 0.091009 0.066847 0.089560 0.099525 0.071535 0.051719 0.054155 0.063599 0.069940 0.076655 0.069160 0.077955 -0.062782 0.082107 0.064759 0.061751 0.071133 0.060917 0.079144 0.085287 0.065770 0.078747 0.068932 0.084881 0.066013 0.094940 0.085981 0.084027 0.095291 0.084041 0.086007
qa: -0.3844 -0.1794 0.0884 -0.1886 -0.2084 -0.1101 -0.1360 0.1715 0.1630 -0.1608 -0.1626 -0.0069 -0.1356 -0.1639 -0.1251 -0.1376 -0.1649 -0.1411 -0.2879 -0.2881 0.0691 0.0814 0.0886 0.1005 0.0910 0.0668 0.0896 0.0995 0.0715 0.0517 0.0542 0.0636 0.0699 0.0767 0.0692 0.0780 -0.0628 0.0821 0.0648 0.0618 0.0711 0.0609 0.0791 0.0853 0.0658 0.0787 0.0689 0.0849 0.0660 0.0949 0.0860 0.0840 0.0953 0.0840 0.0860
va: 1.9796 2.8384 3.7906 3.8811 3.8688 3.8782 3.8908 3.8766 3.8881 3.9411 3.9036 3.8227 3.8435 3.9577 3.8470 3.8540 3.9479 3.8298 3.9485 3.9496 0.9878 1.0134 1.0007 0.9991 1.0163 1.0183 1.0117 1.0097 1.0179 1.0195 1.0190 1.0064 1.0129 1.0058 1.0378 1.0066 1.0480 1.0070 1.0036 1.0061 1.0123 1.0108 1.0100 1.0051 1.0096 1.0052 1.0082 1.0033 1.0040 1.0083 1.0056 1.0107 1.0086 1.0108 1.0053
dispcorr: -0.029228700 hartree
energy: -837.107140779487
dipole: 11.98857 -11.22783 0.76074 -1.04045 1.00094 -0.03951 -0.08227 0.18033 0.09806
magnitude: 0.76805 au
magnitude: 1.95224 debye
